BDBM50222017 1R,3aR,4aS,8aS,9S,9aS)-6-(cyclopropylcarbonyl)-9-[(e)-2-[5-(2-fluorophenyl)-2-pyridinyl]ethenyl]-decahydro-1-methylfuro-[3,4-g]isoquinolin-3(1H)-one::CHEMBL244299
SMILES: C[C@H]1OC(=O)[C@@H]2C[C@@H]3CN(CC[C@H]3[C@H](\C=C\c3ccc(cn3)-c3ccccc3F)[C@H]12)C(=O)C1CC1
InChI Key: InChIKey=BZGUNGVHGQNCIA-QQCNDWJYSA-N
Data: 1 IC50
Activity Spreadsheet -- Enzyme Inhibition Constant Data from BindingDB
Found 1 hit for monomerid = 50222017
Trg + Lig
Ki
nM
ΔG°
kcal/mole
IC50
nM
Kd
nM
EC50/IC50
nM
koff
s-1
kon
M-1s-1
pHTemp
°C
Proteinase-activated receptor 1
(Homo sapiens (Human))
BDBM50222017
(1R,3aR,4aS,8aS,9S,9aS)-6-(cyclopropylcarbonyl)-9-[...)
Show SMILES C[C@H]1OC(=O)[C@@H]2C[C@@H]3CN(CC[C@H]3[C@H](\C=C\c3ccc(cn3)-c3ccccc3F)[C@H]12)C(=O)C1CC1
Show InChI InChI=1S/C29H31FN2O3/c1-17-27-24(11-10-21-9-8-19(15-31-21)23-4-2-3-5-26(23)30)22-12-13-32(28(33)18-6-7-18)16-20(22)14-25(27)29(34)35-17/h2-5,8-11,15,17-18,20,22,24-25,27H,6-7,12-14,16H2,1H3/b11-10+/t17-,20-,22-,24+,25-,27+/m1/s1
n/an/a 8n/an/an/an/an/an/a
Schering-Plough Research Institute
Curated by ChEMBL
Assay Description
Displacement of [3H]haTRAP from PAR1 in human platelet membrane
J Med Chem 50: 5147-60 (2007)
Article DOI: 10.1021/jm070704k
BindingDB Entry DOI: 10.7270/Q2SN08PK