BDBM50222422 6,7-diethoxy-4-(2-(3-(4-fluorophenyl)-1H-pyrazol-4-yl)ethynyl)quinazoline::CHEMBL251125
SMILES: CCOc1cc2ncnc(C#Cc3c[nH]nc3-c3ccc(F)cc3)c2cc1OCC
InChI Key: InChIKey=AHECKEJZVOJBKG-UHFFFAOYSA-N
Data: 1 IC50
Activity Spreadsheet -- Enzyme Inhibition Constant Data from BindingDB
Found 1 hit for monomerid = 50222422
Trg + Lig
Ki
nM
ΔG°
kcal/mole
IC50
nM
Kd
nM
EC50/IC50
nM
koff
s-1
kon
M-1s-1
pHTemp
°C
Epidermal growth factor receptor
(Homo sapiens (Human))
BDBM50222422
(6,7-diethoxy-4-(2-(3-(4-fluorophenyl)-1H-pyrazol-4...)
Show SMILES CCOc1cc2ncnc(C#Cc3c[nH]nc3-c3ccc(F)cc3)c2cc1OCC
Show InChI InChI=1S/C23H19FN4O2/c1-3-29-21-11-18-19(25-14-26-20(18)12-22(21)30-4-2)10-7-16-13-27-28-23(16)15-5-8-17(24)9-6-15/h5-6,8-9,11-14H,3-4H2,1-2H3,(H,27,28)
n/an/a 1.80n/an/an/an/an/an/a
Mitsubishi Pharma Corporation
Curated by ChEMBL
Assay Description
Inhibition of partially purified EGFR tyrosine kinase from human A431 cells
Bioorg Med Chem Lett 17: 5863-7 (2007)
Article DOI: 10.1016/j.bmcl.2007.08.020
BindingDB Entry DOI: 10.7270/Q2H70FJ7