BDBM50222431 (R)-1-(4-(6,7-diethoxyquinazolin-4-yl)-2-methyl-1-phenylbut-3-yn-2-yl)piperidine-4-carboxylic acid::CHEMBL399373
SMILES: CCOc1cc2ncnc(C#C[C@@](C)(Cc3ccccc3)N3CCC(CC3)C(O)=O)c2cc1OCC
InChI Key: InChIKey=GRSVZOBWWBQUNG-LJAQVGFWSA-N
Data: 1 IC50
Activity Spreadsheet -- Enzyme Inhibition Constant Data from BindingDB
Found 1 hit for monomerid = 50222431
Trg + Lig
Ki
nM
ΔG°
kcal/mole
IC50
nM
Kd
nM
EC50/IC50
nM
koff
s-1
kon
M-1s-1
pHTemp
°C
Epidermal growth factor receptor
(Homo sapiens (Human))
BDBM50222431
((R)-1-(4-(6,7-diethoxyquinazolin-4-yl)-2-methyl-1-...)
Show SMILES CCOc1cc2ncnc(C#C[C@@](C)(Cc3ccccc3)N3CCC(CC3)C(O)=O)c2cc1OCC
Show InChI InChI=1S/C29H33N3O4/c1-4-35-26-17-23-24(30-20-31-25(23)18-27(26)36-5-2)11-14-29(3,19-21-9-7-6-8-10-21)32-15-12-22(13-16-32)28(33)34/h6-10,17-18,20,22H,4-5,12-13,15-16,19H2,1-3H3,(H,33,34)/t29-/m0/s1
n/an/a 4.20n/an/an/an/an/an/a
Mitsubishi Pharma Corporation
Curated by ChEMBL
Assay Description
Inhibition of partially purified EGFR tyrosine kinase from human A431 cells
Bioorg Med Chem Lett 17: 5863-7 (2007)
Article DOI: 10.1016/j.bmcl.2007.08.020
BindingDB Entry DOI: 10.7270/Q2H70FJ7