BDBM50222700 CHEMBL161864
SMILES: Oc1cc(NCCCNCc2cc(Br)cc(Br)c2)nc2ccccc12
InChI Key: InChIKey=PDHVQCVGBAIYEA-UHFFFAOYSA-N
Data: 1 IC50
Activity Spreadsheet -- Enzyme Inhibition Constant Data from BindingDB
Found 1 hit for monomerid = 50222700
Trg + Lig
Ki
nM
ΔG°
kcal/mole
IC50
nM
Kd
nM
EC50/IC50
nM
koff
s-1
kon
M-1s-1
pHTemp
°C
Methionyl-tRNA synthetase
(Escherichia coli (strain K12))
BDBM50222700
(CHEMBL161864)
Show SMILES Oc1cc(NCCCNCc2cc(Br)cc(Br)c2)nc2ccccc12
Show InChI InChI=1S/C19H19Br2N3O/c20-14-8-13(9-15(21)10-14)12-22-6-3-7-23-19-11-18(25)16-4-1-2-5-17(16)24-19/h1-2,4-5,8-11,22H,3,6-7,12H2,(H2,23,24,25)
n/an/a<3n/an/an/an/an/an/a
GlaxoSmithKline
Curated by ChEMBL
Assay Description
Compound tested for inhibition of Staphylococcus aureus MRS(methionyl tRNA synthetase) in aminoacylation assay
Bioorg Med Chem Lett 13: 665-8 (2003)
BindingDB Entry DOI: 10.7270/Q2KP81JD