BDBM50223195 CHEMBL30271
SMILES: COc1ccc(cc1)-c1cc2nc(O)ccc2c(NCCCN)n1
InChI Key: InChIKey=APEWXCSQTNDVRQ-UHFFFAOYSA-N
Data: 1 IC50
Activity Spreadsheet -- Enzyme Inhibition Constant Data from BindingDB
Found 1 hit for monomerid = 50223195
Trg + Lig
Ki
nM
ΔG°
kcal/mole
IC50
nM
Kd
nM
EC50/IC50
nM
koff
s-1
kon
M-1s-1
pHTemp
°C
Tyrosine-protein kinase SYK
(Homo sapiens (Human))
BDBM50223195
(CHEMBL30271)
Show SMILES COc1ccc(cc1)-c1cc2nc(O)ccc2c(NCCCN)n1
Show InChI InChI=1S/C18H20N4O2/c1-24-13-5-3-12(4-6-13)15-11-16-14(7-8-17(23)21-16)18(22-15)20-10-2-9-19/h3-8,11H,2,9-10,19H2,1H3,(H,20,22)(H,21,23)
NCI pathway
Reactome pathway
n/an/a>30n/an/an/an/an/an/a
Boehringer Ingelheim Pharmaceuticals
Curated by ChEMBL
Assay Description
Inhibitory activity against spleen tyrosine kinase (SYK)
Bioorg Med Chem Lett 13: 1415-8 (2003)
BindingDB Entry DOI: 10.7270/Q2MC8ZCJ