null
SMILES: COc1ccc(cc1OC1CCCC1)C1(CCN(CC1)[C@H](C)C(=O)NO)C#N
InChI Key: InChIKey=NSYYFQMQNAQQGB-OAHLLOKOSA-N
Activity Spreadsheet -- Enzyme Inhibition Constant Data from BindingDB
Found 1 hit for monomerid = 50223341
Trg + Lig
Ki
nM
ΔG°
kcal/mole
IC50
nM
Kd
nM
EC50/IC50
nM
koff
s-1
kon
M-1s-1
pHTemp
°C
cAMP-specific 3',5'-cyclic phosphodiesterase 4A/4B/4C/4D
(Homo sapiens (Human))
BDBM50223341
(CHEMBL294494)
Show SMILES COc1ccc(cc1OC1CCCC1)C1(CCN(CC1)[C@H](C)C(=O)NO)C#N
Show InChI InChI=1S/C21H29N3O4/c1-15(20(25)23-26)24-11-9-21(14-22,10-12-24)16-7-8-18(27-2)19(13-16)28-17-5-3-4-6-17/h7-8,13,15,17,26H,3-6,9-12H2,1-2H3,(H,23,25)/t15-/m1/s1
n/an/a 0.910n/an/an/an/an/an/a
Minase Research Institute
Curated by ChEMBL
Assay Description
Inhibition of phosphodiesterase 4 (PDE4) prepared from human U937 cells
Bioorg Med Chem Lett 14: 207-10 (2004)
BindingDB Entry DOI: 10.7270/Q21G0PFV