null
SMILES: COc1ccc(cc1OCC1CC1)C1(CCN(CC(=O)NO)CC1)C#N
InChI Key: InChIKey=IIXVILNNIWHUJI-UHFFFAOYSA-N
Activity Spreadsheet -- Enzyme Inhibition Constant Data from BindingDB
Found 1 hit for monomerid = 50223346
Trg + Lig
Ki
nM
ΔG°
kcal/mole
IC50
nM
Kd
nM
EC50/IC50
nM
koff
s-1
kon
M-1s-1
pHTemp
°C
cAMP-specific 3',5'-cyclic phosphodiesterase 4A/4B/4C/4D
(Homo sapiens (Human))
BDBM50223346
(CHEMBL65114)
Show SMILES COc1ccc(cc1OCC1CC1)C1(CCN(CC(=O)NO)CC1)C#N
Show InChI InChI=1S/C19H25N3O4/c1-25-16-5-4-15(10-17(16)26-12-14-2-3-14)19(13-20)6-8-22(9-7-19)11-18(23)21-24/h4-5,10,14,24H,2-3,6-9,11-12H2,1H3,(H,21,23)
n/an/a 0.290n/an/an/an/an/an/a
Minase Research Institute
Curated by ChEMBL
Assay Description
Inhibition of phosphodiesterase 4 (PDE4) prepared from human U937 cells
Bioorg Med Chem Lett 14: 207-10 (2004)
BindingDB Entry DOI: 10.7270/Q21G0PFV