BDBM50223408 CHEMBL312098
SMILES: ONC(=O)\C=C\C=C\c1ccc(Cl)cc1
InChI Key: InChIKey=CMCCBRAFFWTYIH-ZPUQHVIOSA-N
Data: 1 IC50
Activity Spreadsheet -- Enzyme Inhibition Constant Data from BindingDB
Found 1 hit for monomerid = 50223408
Trg + Lig
Ki
nM
ΔG°
kcal/mole
IC50
nM
Kd
nM
EC50/IC50
nM
koff
s-1
kon
M-1s-1
pHTemp
°C
Histone deacetylase 1/2/3/4/5/6/7/8/9/11/Polyamine deacetylase HDAC10
(Homo sapiens (Human))
BDBM50223408
(CHEMBL312098)
Show SMILES ONC(=O)\C=C\C=C\c1ccc(Cl)cc1
Show InChI InChI=1S/C11H10ClNO2/c12-10-7-5-9(6-8-10)3-1-2-4-11(14)13-15/h1-8,15H,(H,13,14)/b3-1+,4-2+
n/an/a 252n/an/an/an/an/an/a
University College London
Curated by ChEMBL
Assay Description
Inhibition of histone deacetylase (HDAC) activity in HeLa cell nuclear extract
Bioorg Med Chem Lett 14: 2477-81 (2004)
BindingDB Entry DOI: 10.7270/Q2S184Q6