BDBM50223929 7-(2,2-Dimethyl-propyl)-6-(3-methyl-2,4-dioxo-1,3,8-triaza-spiro[4.5]dec-8-ylmethyl)-7Hpyrrolo[2,3-d]pyrimidine-2-carbonitrile::7-(2,2-dimethyl-propyl)-6-(3-methyl-2,4-dioxo-1,3,8-triaza-spiro[4.5]dec-8-ylmethyl)-7H-pyrrolo[2,3-d]pyrimidine-2-carbonitrile::CHEMBL249965
SMILES: CN1C(=O)NC2(CCN(Cc3cc4cnc(nc4n3CC(C)(C)C)C#N)CC2)C1=O
InChI Key: InChIKey=USHMVOYUHZUPCH-UHFFFAOYSA-N
Data: 2 IC50
Activity Spreadsheet -- Enzyme Inhibition Constant Data from BindingDB
Found 2 hits for monomerid = 50223929
Trg + Lig
Ki
nM
ΔG°
kcal/mole
IC50
nM
Kd
nM
EC50/IC50
nM
koff
s-1
kon
M-1s-1
pHTemp
°C
Cathepsin K
(Rattus norvegicus)
BDBM50223929
(7-(2,2-Dimethyl-propyl)-6-(3-methyl-2,4-dioxo-1,3,...)
Show SMILES CN1C(=O)NC2(CCN(Cc3cc4cnc(nc4n3CC(C)(C)C)C#N)CC2)C1=O
Show InChI InChI=1S/C21H27N7O2/c1-20(2,3)13-28-15(9-14-11-23-16(10-22)24-17(14)28)12-27-7-5-21(6-8-27)18(29)26(4)19(30)25-21/h9,11H,5-8,12-13H2,1-4H3,(H,25,30)
Reactome pathway
n/an/a 12n/an/an/an/an/an/a
Novartis Institutes for BioMedical Research
Curated by ChEMBL
Assay Description
Inhibition of rat recombinant cathepsin K expressed in Sf21 cells by fluorescence assay
J Med Chem 51: 5459-62 (2008)
Article DOI: 10.1021/jm800626a
BindingDB Entry DOI: 10.7270/Q2SF2W0R
Cathepsin S
(Homo sapiens (Human))
BDBM50223929
(7-(2,2-Dimethyl-propyl)-6-(3-methyl-2,4-dioxo-1,3,...)
Show SMILES CN1C(=O)NC2(CCN(Cc3cc4cnc(nc4n3CC(C)(C)C)C#N)CC2)C1=O
Show InChI InChI=1S/C21H27N7O2/c1-20(2,3)13-28-15(9-14-11-23-16(10-22)24-17(14)28)12-27-7-5-21(6-8-27)18(29)26(4)19(30)25-21/h9,11H,5-8,12-13H2,1-4H3,(H,25,30)
Reactome pathway
n/an/a>1.00E+3n/an/an/an/an/an/a
Novartis Institutes for BioMedical Research
Curated by ChEMBL
Assay Description
Inhibition of cathepsin S by fluorescence assay
Bioorg Med Chem Lett 17: 6096-100 (2007)
Article DOI: 10.1016/j.bmcl.2007.09.047
BindingDB Entry DOI: 10.7270/Q2G160K6