BDBM50223941 6-(4-((diethylamino)methyl)benzyl)-7-cyclohexyl-7H-pyrrolo[2,3-d]pyrimidine-2-carbonitrile::CHEMBL430017
SMILES: CCN(CC)Cc1ccc(Cc2cc3cnc(nc3n2C2CCCCC2)C#N)cc1
InChI Key: InChIKey=GMWDSXUYOQNALT-UHFFFAOYSA-N
Data: 2 IC50
Activity Spreadsheet -- Enzyme Inhibition Constant Data from BindingDB
Found 2 hits for monomerid = 50223941
Trg + Lig
Ki
nM
ΔG°
kcal/mole
IC50
nM
Kd
nM
EC50/IC50
nM
koff
s-1
kon
M-1s-1
pHTemp
°C
Cathepsin K
(Homo sapiens (Human))
BDBM50223941
(6-(4-((diethylamino)methyl)benzyl)-7-cyclohexyl-7H...)
Show SMILES CCN(CC)Cc1ccc(Cc2cc3cnc(nc3n2C2CCCCC2)C#N)cc1
Show InChI InChI=1S/C25H31N5/c1-3-29(4-2)18-20-12-10-19(11-13-20)14-23-15-21-17-27-24(16-26)28-25(21)30(23)22-8-6-5-7-9-22/h10-13,15,17,22H,3-9,14,18H2,1-2H3
Reactome pathway
n/an/a 4.70n/an/an/an/an/an/a
Novartis Institutes for BioMedical Research
Curated by ChEMBL
Assay Description
Inhibition of cathepsin K by fluorescence assay
Bioorg Med Chem Lett 17: 6096-100 (2007)
Article DOI: 10.1016/j.bmcl.2007.09.047
BindingDB Entry DOI: 10.7270/Q2G160K6
Cathepsin S
(Homo sapiens (Human))
BDBM50223941
(6-(4-((diethylamino)methyl)benzyl)-7-cyclohexyl-7H...)
Show SMILES CCN(CC)Cc1ccc(Cc2cc3cnc(nc3n2C2CCCCC2)C#N)cc1
Show InChI InChI=1S/C25H31N5/c1-3-29(4-2)18-20-12-10-19(11-13-20)14-23-15-21-17-27-24(16-26)28-25(21)30(23)22-8-6-5-7-9-22/h10-13,15,17,22H,3-9,14,18H2,1-2H3
Reactome pathway
n/an/a>1.00E+3n/an/an/an/an/an/a
Novartis Institutes for BioMedical Research
Curated by ChEMBL
Assay Description
Inhibition of cathepsin S by fluorescence assay
Bioorg Med Chem Lett 17: 6096-100 (2007)
Article DOI: 10.1016/j.bmcl.2007.09.047
BindingDB Entry DOI: 10.7270/Q2G160K6