BDBM50224038 CHEMBL38016
SMILES: ONC(=O)CC1Sc2ccccc2N(CCC2OCCO2)C1=O
InChI Key: InChIKey=BVLDZANUDHSBSW-UHFFFAOYSA-N
Data: 1 IC50
Activity Spreadsheet -- Enzyme Inhibition Constant Data from BindingDB
Found 1 hit for monomerid = 50224038
Trg + Lig
Ki
nM
ΔG°
kcal/mole
IC50
nM
Kd
nM
EC50/IC50
nM
koff
s-1
kon
M-1s-1
pHTemp
°C
Peptide deformylase
(Staphylococcus aureus (strain Mu50 / ATCC 700699))
BDBM50224038
(CHEMBL38016)
Show SMILES ONC(=O)CC1Sc2ccccc2N(CCC2OCCO2)C1=O
Show InChI InChI=1S/C15H18N2O5S/c18-13(16-20)9-12-15(19)17(6-5-14-21-7-8-22-14)10-3-1-2-4-11(10)23-12/h1-4,12,14,20H,5-9H2,(H,16,18)
n/an/a<5n/an/an/an/an/an/a
Genomics Institute of the Novartis Research Foundation
Curated by ChEMBL
Assay Description
Inhibitory activity towards Ni-peptide deformylase of Staphylococcus aureus
Bioorg Med Chem Lett 14: 1477-81 (2004)
Article DOI: 10.1016/j.bmcl.2004.01.014
BindingDB Entry DOI: 10.7270/Q2MS3S6G