BDBM50224398 8-(4-methoxyphenyl)-1h-pyrrolo[2'',3'':4',5']pyrido[3',2':4,5]thieno[3,2-d]pyrimidin-7(8H)-one::CHEMBL238079
SMILES: COc1ccc(cc1)-n1cnc2c(sc3ncc4cc[nH]c4c23)c1=O
InChI Key: InChIKey=IBCHXMWHJILXER-UHFFFAOYSA-N
Data: 1 KI  2 IC50
Activity Spreadsheet -- Enzyme Inhibition Constant Data from BindingDB
Found 3 hits for monomerid = 50224398
Trg + Lig
Ki
nM
ΔG°
kcal/mole
IC50
nM
Kd
nM
EC50/IC50
nM
koff
s-1
kon
M-1s-1
pHTemp
°C
Metabotropic glutamate receptor
(RAT)
BDBM50224398
(8-(4-methoxyphenyl)-1h-pyrrolo[2'',3'':4',5']pyrid...)
Show SMILES COc1ccc(cc1)-n1cnc2c(sc3ncc4cc[nH]c4c23)c1=O
Show InChI InChI=1S/C18H12N4O2S/c1-24-12-4-2-11(3-5-12)22-9-21-15-13-14-10(6-7-19-14)8-20-17(13)25-16(15)18(22)23/h2-9,19H,1H3
29n/an/an/an/an/an/an/an/a
Schering-Plough Research Institute
Curated by ChEMBL
Assay Description
Displacement of [3H]9-Dimethylamino-3-(4-methoxy-phenyl)-3H-pyrido[3',2':4,5]thieno[3,2-d]pyrimidin-4-one from mGluR1 in rat cerebellum membrane
J Med Chem 50: 5550-3 (2007)
Article DOI: 10.1021/jm070590c
BindingDB Entry DOI: 10.7270/Q2D50MQX
Metabotropic glutamate receptor 1
(Homo sapiens (Human))
BDBM50224398
(8-(4-methoxyphenyl)-1h-pyrrolo[2'',3'':4',5']pyrid...)
Show SMILES COc1ccc(cc1)-n1cnc2c(sc3ncc4cc[nH]c4c23)c1=O
Show InChI InChI=1S/C18H12N4O2S/c1-24-12-4-2-11(3-5-12)22-9-21-15-13-14-10(6-7-19-14)8-20-17(13)25-16(15)18(22)23/h2-9,19H,1H3
n/an/a 4.90n/an/an/an/an/an/a
Schering-Plough Research Institute
Curated by ChEMBL
Assay Description
Antagonist activity at human mGluR1a expressed in CHO cells assessed by measuring intracellular calcium by FLIPR assay
J Med Chem 50: 5550-3 (2007)
Article DOI: 10.1021/jm070590c
BindingDB Entry DOI: 10.7270/Q2D50MQX
Metabotropic glutamate receptor 5
(Homo sapiens (Human))
BDBM50224398
(8-(4-methoxyphenyl)-1h-pyrrolo[2'',3'':4',5']pyrid...)
Show SMILES COc1ccc(cc1)-n1cnc2c(sc3ncc4cc[nH]c4c23)c1=O
Show InChI InChI=1S/C18H12N4O2S/c1-24-12-4-2-11(3-5-12)22-9-21-15-13-14-10(6-7-19-14)8-20-17(13)25-16(15)18(22)23/h2-9,19H,1H3
n/an/a>1.00E+4n/an/an/an/an/an/a
Schering-Plough Research Institute
Curated by ChEMBL
Assay Description
Antagonist activity at human mGluR5b expressed in HEK293 cells assessed by measuring intracellular calcium by FLIPR assay
J Med Chem 50: 5550-3 (2007)
Article DOI: 10.1021/jm070590c
BindingDB Entry DOI: 10.7270/Q2D50MQX