BDBM50224482 CHEMBL12322
SMILES: CC(N)COCC(C)OCC(C)OCC(C)NCC(O)COc1ccccc1CC=C
InChI Key: InChIKey=WGFQNLLQPZNKGH-UHFFFAOYSA-N
Data: 4 Kd
Activity Spreadsheet -- Enzyme Inhibition Constant Data from BindingDB
Found 4 hits for monomerid = 50224482
Trg + Lig
Ki
nM
ΔG°
kcal/mole
IC50
nM
Kd
nM
EC50/IC50
nM
koff
s-1
kon
M-1s-1
pHTemp
°C
Adrenergic receptor beta
(Rattus norvegicus (Rat))
BDBM50224482
(CHEMBL12322)
Show SMILES CC(N)COCC(C)OCC(C)OCC(C)NCC(O)COc1ccccc1CC=C
Show InChI InChI=1S/C24H42N2O5/c1-6-9-22-10-7-8-11-24(22)31-17-23(27)12-26-19(3)14-29-21(5)16-30-20(4)15-28-13-18(2)25/h6-8,10-11,18-21,23,26-27H,1,9,12-17,25H2,2-5H3
n/an/an/a 1.60n/an/an/an/an/a
TBA
Curated by ChEMBL
Assay Description
Binding affinity towards rat beta adrenergic receptor from lung membranes.
J Med Chem 26: 7-11 (1983)
BindingDB Entry DOI: 10.7270/Q20867H8
Adrenergic receptor beta
(Rattus norvegicus (Rat))
BDBM50224482
(CHEMBL12322)
Show SMILES CC(N)COCC(C)OCC(C)OCC(C)NCC(O)COc1ccccc1CC=C
Show InChI InChI=1S/C24H42N2O5/c1-6-9-22-10-7-8-11-24(22)31-17-23(27)12-26-19(3)14-29-21(5)16-30-20(4)15-28-13-18(2)25/h6-8,10-11,18-21,23,26-27H,1,9,12-17,25H2,2-5H3
n/an/an/a 4.60n/an/an/an/an/a
TBA
Curated by ChEMBL
Assay Description
Binding affinity towards rat beta adrenergic receptor from heart membranes.
J Med Chem 26: 7-11 (1983)
BindingDB Entry DOI: 10.7270/Q20867H8
Adrenergic receptor beta
(Rattus norvegicus (Rat))
BDBM50224482
(CHEMBL12322)
Show SMILES CC(N)COCC(C)OCC(C)OCC(C)NCC(O)COc1ccccc1CC=C
Show InChI InChI=1S/C24H42N2O5/c1-6-9-22-10-7-8-11-24(22)31-17-23(27)12-26-19(3)14-29-21(5)16-30-20(4)15-28-13-18(2)25/h6-8,10-11,18-21,23,26-27H,1,9,12-17,25H2,2-5H3
n/an/an/a 6.20n/an/an/an/an/a
TBA
Curated by ChEMBL
Assay Description
Binding affinity towards rat beta adrenergic receptor from lung membranes.
J Med Chem 26: 7-11 (1983)
BindingDB Entry DOI: 10.7270/Q20867H8
Adrenergic receptor beta
(Rattus norvegicus (Rat))
BDBM50224482
(CHEMBL12322)
Show SMILES CC(N)COCC(C)OCC(C)OCC(C)NCC(O)COc1ccccc1CC=C
Show InChI InChI=1S/C24H42N2O5/c1-6-9-22-10-7-8-11-24(22)31-17-23(27)12-26-19(3)14-29-21(5)16-30-20(4)15-28-13-18(2)25/h6-8,10-11,18-21,23,26-27H,1,9,12-17,25H2,2-5H3
n/an/an/a 8n/an/an/an/an/a
TBA
Curated by ChEMBL
Assay Description
Binding affinity towards rat beta adrenergic receptor from heart membranes.
J Med Chem 26: 7-11 (1983)
BindingDB Entry DOI: 10.7270/Q20867H8