BDBM50224500 (E)-2-(4-(5-amino-1H-indol-3-yl)piperidin-1-yl)-2-(1-(3-(3,4,5-trifluorophenyl)acryloyl)piperidin-4-yl)acetic acid::CHEMBL237806
SMILES: Nc1ccc2[nH]cc(C3CCN(CC3)C(C3CCN(CC3)C(=O)\C=C\c3cc(F)c(F)c(F)c3)C(O)=O)c2c1
InChI Key: InChIKey=VDOBJWBJSQLDHG-DAFODLJHSA-N
Data: 1 IC50
Activity Spreadsheet -- Enzyme Inhibition Constant Data from BindingDB
Found 1 hit for monomerid = 50224500
Trg + Lig
Ki
nM
ΔG°
kcal/mole
IC50
nM
Kd
nM
EC50/IC50
nM
koff
s-1
kon
M-1s-1
pHTemp
°C
C-C chemokine receptor type 2
(Homo sapiens (Human))
BDBM50224500
((E)-2-(4-(5-amino-1H-indol-3-yl)piperidin-1-yl)-2-...)
Show SMILES Nc1ccc2[nH]cc(C3CCN(CC3)C(C3CCN(CC3)C(=O)\C=C\c3cc(F)c(F)c(F)c3)C(O)=O)c2c1 |w:14.36|
Show InChI InChI=1S/C29H31F3N4O3/c30-23-13-17(14-24(31)27(23)32)1-4-26(37)35-9-7-19(8-10-35)28(29(38)39)36-11-5-18(6-12-36)22-16-34-25-3-2-20(33)15-21(22)25/h1-4,13-16,18-19,28,34H,5-12,33H2,(H,38,39)/b4-1+
n/an/a 4n/an/an/an/an/an/a
Johnson & Johnson Pharmaceutical Research and Development
Curated by ChEMBL
Assay Description
Inhibition of human CCR2
J Med Chem 50: 5561-3 (2007)
Article DOI: 10.1021/jm070902b
BindingDB Entry DOI: 10.7270/Q24M948Q