BDBM50224532 CHEMBL12066
SMILES: CC(N)COCC(C)OCC(C)OCC(C)OCC(C)OCC(C)OCC(C)NCC(O)COc1cccc2ccccc12
InChI Key: InChIKey=JPBOOFPXYMPRIT-UHFFFAOYSA-N
Data: 2 Kd
Activity Spreadsheet -- Enzyme Inhibition Constant Data from BindingDB
Found 2 hits for monomerid = 50224532
Trg + Lig
Ki
nM
ΔG°
kcal/mole
IC50
nM
Kd
nM
EC50/IC50
nM
koff
s-1
kon
M-1s-1
pHTemp
°C
Adrenergic receptor beta
(Rattus norvegicus (Rat))
BDBM50224532
(CHEMBL12066)
Show SMILES CC(N)COCC(C)OCC(C)OCC(C)OCC(C)OCC(C)OCC(C)NCC(O)COc1cccc2ccccc12
Show InChI InChI=1S/C34H58N2O8/c1-24(35)16-38-18-26(3)40-20-28(5)42-22-30(7)43-21-29(6)41-19-27(4)39-17-25(2)36-15-32(37)23-44-34-14-10-12-31-11-8-9-13-33(31)34/h8-14,24-30,32,36-37H,15-23,35H2,1-7H3
n/an/an/a 2.60n/an/an/an/an/a
TBA
Curated by ChEMBL
Assay Description
Binding affinity towards rat beta adrenergic receptor from heart membranes.
J Med Chem 26: 7-11 (1983)
BindingDB Entry DOI: 10.7270/Q20867H8
Adrenergic receptor beta
(Rattus norvegicus (Rat))
BDBM50224532
(CHEMBL12066)
Show SMILES CC(N)COCC(C)OCC(C)OCC(C)OCC(C)OCC(C)OCC(C)NCC(O)COc1cccc2ccccc12
Show InChI InChI=1S/C34H58N2O8/c1-24(35)16-38-18-26(3)40-20-28(5)42-22-30(7)43-21-29(6)41-19-27(4)39-17-25(2)36-15-32(37)23-44-34-14-10-12-31-11-8-9-13-33(31)34/h8-14,24-30,32,36-37H,15-23,35H2,1-7H3
n/an/an/a 4.30n/an/an/an/an/a
TBA
Curated by ChEMBL
Assay Description
Binding affinity towards rat beta adrenergic receptor from lung membranes.
J Med Chem 26: 7-11 (1983)
BindingDB Entry DOI: 10.7270/Q20867H8