BDBM50224577 4-(2-(2-(4-(3-bromophenyl)-3-hydroxybutyl)-5-oxopyrazolidin-1-yl)ethyl)benzoic acid::CHEMBL249538
SMILES: OC(CCN1CCC(=O)N1CCc1ccc(cc1)C(O)=O)Cc1cccc(Br)c1
InChI Key: InChIKey=MMKYRZFPISEJKE-UHFFFAOYSA-N
Data: 2 KI  1 EC50
Activity Spreadsheet -- Enzyme Inhibition Constant Data from BindingDB
Found 3 hits for monomerid = 50224577
Trg + Lig
Ki
nM
ΔG°
kcal/mole
IC50
nM
Kd
nM
EC50/IC50
nM
koff
s-1
kon
M-1s-1
pHTemp
°C
Prostaglandin E2 receptor EP4 subtype
(Homo sapiens (Human))
BDBM50224577
(4-(2-(2-(4-(3-bromophenyl)-3-hydroxybutyl)-5-oxopy...)
Show SMILES OC(CCN1CCC(=O)N1CCc1ccc(cc1)C(O)=O)Cc1cccc(Br)c1
Show InChI InChI=1S/C22H25BrN2O4/c23-19-3-1-2-17(14-19)15-20(26)9-11-24-12-10-21(27)25(24)13-8-16-4-6-18(7-5-16)22(28)29/h1-7,14,20,26H,8-13,15H2,(H,28,29)
Reactome pathway
13n/an/an/an/an/an/an/an/a
EMD-Serono Research Institute
Curated by ChEMBL
Assay Description
Binding affinity at human prostaglandin EP4 receptor
Bioorg Med Chem Lett 17: 6572-5 (2007)
Article DOI: 10.1016/j.bmcl.2007.09.074
BindingDB Entry DOI: 10.7270/Q29887V9
Prostaglandin E2 receptor EP2 subtype
(Homo sapiens (Human))
BDBM50224577
(4-(2-(2-(4-(3-bromophenyl)-3-hydroxybutyl)-5-oxopy...)
Show SMILES OC(CCN1CCC(=O)N1CCc1ccc(cc1)C(O)=O)Cc1cccc(Br)c1
Show InChI InChI=1S/C22H25BrN2O4/c23-19-3-1-2-17(14-19)15-20(26)9-11-24-12-10-21(27)25(24)13-8-16-4-6-18(7-5-16)22(28)29/h1-7,14,20,26H,8-13,15H2,(H,28,29)
Reactome pathway
5.45E+3n/an/an/an/an/an/an/an/a
EMD-Serono Research Institute
Curated by ChEMBL
Assay Description
Binding affinity at human prostaglandin EP2 receptor
Bioorg Med Chem Lett 17: 6572-5 (2007)
Article DOI: 10.1016/j.bmcl.2007.09.074
BindingDB Entry DOI: 10.7270/Q29887V9
Prostaglandin E2 receptor EP4 subtype
(Homo sapiens (Human))
BDBM50224577
(4-(2-(2-(4-(3-bromophenyl)-3-hydroxybutyl)-5-oxopy...)
Show SMILES OC(CCN1CCC(=O)N1CCc1ccc(cc1)C(O)=O)Cc1cccc(Br)c1
Show InChI InChI=1S/C22H25BrN2O4/c23-19-3-1-2-17(14-19)15-20(26)9-11-24-12-10-21(27)25(24)13-8-16-4-6-18(7-5-16)22(28)29/h1-7,14,20,26H,8-13,15H2,(H,28,29)
Reactome pathway
n/an/an/an/a 0.200n/an/an/an/a
EMD-Serono Research Institute
Curated by ChEMBL
Assay Description
Agonist activity at human prostaglandin EP4 receptor
Bioorg Med Chem Lett 17: 6572-5 (2007)
Article DOI: 10.1016/j.bmcl.2007.09.074
BindingDB Entry DOI: 10.7270/Q29887V9