BDBM50224838 1-{6-[4-(6-fluoro-1H-benzoimidazol-2-yl)-phenoxy]-pyridin-3-yl}-1,7,9-triaza-spiro[4.5]decane-6,8,10-trione::CHEMBL250758
SMILES: Fc1ccc2nc([nH]c2c1)-c1ccc(Oc2ccc(cn2)N2CCCC22C(=O)NC(=O)NC2=O)cc1
InChI Key: InChIKey=VQQQRTMSDPVBAF-UHFFFAOYSA-N
Data: 1 IC50
Activity Spreadsheet -- Enzyme Inhibition Constant Data from BindingDB
Found 1 hit for monomerid = 50224838
Trg + Lig
Ki
nM
ΔG°
kcal/mole
IC50
nM
Kd
nM
EC50/IC50
nM
koff
s-1
kon
M-1s-1
pHTemp
°C
Collagenase 3
(Homo sapiens (Human))
BDBM50224838
(1-{6-[4-(6-fluoro-1H-benzoimidazol-2-yl)-phenoxy]-...)
Show SMILES Fc1ccc2nc([nH]c2c1)-c1ccc(Oc2ccc(cn2)N2CCCC22C(=O)NC(=O)NC2=O)cc1
Show InChI InChI=1S/C25H19FN6O4/c26-15-4-8-18-19(12-15)29-21(28-18)14-2-6-17(7-3-14)36-20-9-5-16(13-27-20)32-11-1-10-25(32)22(33)30-24(35)31-23(25)34/h2-9,12-13H,1,10-11H2,(H,28,29)(H2,30,31,33,34,35)
NCI pathway
Reactome pathway
n/an/a 0.0800n/an/an/an/an/an/a
Pfizer Global Research & Development
Curated by ChEMBL
Assay Description
Inhibition of MMP13
Bioorg Med Chem Lett 17: 6529-34 (2007)
Article DOI: 10.1016/j.bmcl.2007.09.085
BindingDB Entry DOI: 10.7270/Q2ZW1KMR