BDBM50224849 1-[6-(4-bromo-phenoxy)-pyridin-3-yl]-1,7,9-triaza-spiro[4.5]decane-6,8,10-trione::CHEMBL401414
SMILES: Brc1ccc(Oc2ccc(cn2)N2CCCC22C(=O)NC(=O)NC2=O)cc1
InChI Key: InChIKey=CWOIBYBXJSRSGT-UHFFFAOYSA-N
Data: 1 IC50
Activity Spreadsheet -- Enzyme Inhibition Constant Data from BindingDB
Found 1 hit for monomerid = 50224849
Trg + Lig
Ki
nM
ΔG°
kcal/mole
IC50
nM
Kd
nM
EC50/IC50
nM
koff
s-1
kon
M-1s-1
pHTemp
°C
Collagenase 3
(Homo sapiens (Human))
BDBM50224849
(1-[6-(4-bromo-phenoxy)-pyridin-3-yl]-1,7,9-triaza-...)
Show SMILES Brc1ccc(Oc2ccc(cn2)N2CCCC22C(=O)NC(=O)NC2=O)cc1
Show InChI InChI=1S/C18H15BrN4O4/c19-11-2-5-13(6-3-11)27-14-7-4-12(10-20-14)23-9-1-8-18(23)15(24)21-17(26)22-16(18)25/h2-7,10H,1,8-9H2,(H2,21,22,24,25,26)
NCI pathway
Reactome pathway
n/an/a 0.600n/an/an/an/an/an/a
Pfizer Global Research & Development
Curated by ChEMBL
Assay Description
Inhibition of MMP13
Bioorg Med Chem Lett 17: 6529-34 (2007)
Article DOI: 10.1016/j.bmcl.2007.09.085
BindingDB Entry DOI: 10.7270/Q2ZW1KMR