BDBM50225247 CHEMBL44558
SMILES: [H][C@@]12Cc3c[nH]c4cccc(C1OCCN2c1ccccc1)c34
InChI Key: InChIKey=NCRJDXKJBVILMT-DUSLRRAJSA-N
Data: 2 IC50
Activity Spreadsheet -- Enzyme Inhibition Constant Data from BindingDB
Found 2 hits for monomerid = 50225247
Trg + Lig
Ki
nM
ΔG°
kcal/mole
IC50
nM
Kd
nM
EC50/IC50
nM
koff
s-1
kon
M-1s-1
pHTemp
°C
Adrenergic receptor alpha-2
(RAT-NEONATAL RAT-Rattus norvegicus (rat))
BDBM50225247
(CHEMBL44558)
Show SMILES [H][C@@]12Cc3c[nH]c4cccc(C1OCCN2c1ccccc1)c34
Show InChI InChI=1S/C19H18N2O/c1-2-5-14(6-3-1)21-9-10-22-19-15-7-4-8-16-18(15)13(12-20-16)11-17(19)21/h1-8,12,17,19-20H,9-11H2/t17-,19?/m1/s1
n/an/a 7n/an/an/an/an/an/a
TBA
Curated by ChEMBL
Assay Description
Alpha-2 adrenergic receptor activity assessed in vitro for displacement of [3H]clonidine from specific binding sites on rat striatal membranes
J Med Chem 27: 1607-13 (1984)
BindingDB Entry DOI: 10.7270/Q2SJ1NT8
Dopamine receptor
(Rattus norvegicus (rat)-RAT-Rattus norvegicus (Rat...)
BDBM50225247
(CHEMBL44558)
Show SMILES [H][C@@]12Cc3c[nH]c4cccc(C1OCCN2c1ccccc1)c34
Show InChI InChI=1S/C19H18N2O/c1-2-5-14(6-3-1)21-9-10-22-19-15-7-4-8-16-18(15)13(12-20-16)11-17(19)21/h1-8,12,17,19-20H,9-11H2/t17-,19?/m1/s1
Reactome pathway
n/an/a 2n/an/an/an/an/an/a
TBA
Curated by ChEMBL
Assay Description
Dopaminergic activity assessed in vitro for displacement of [3H]apomorphine from specific binding sites on rat striatal membranes
J Med Chem 27: 1607-13 (1984)
BindingDB Entry DOI: 10.7270/Q2SJ1NT8