null
SMILES: CC(C)CC(N)C(=O)NC(C)(C)P(O)(O)=O
InChI Key: InChIKey=UGMVGZQWYQMFOX-UHFFFAOYSA-N
Activity Spreadsheet -- Enzyme Inhibition Constant Data from BindingDB
Found 1 hit for monomerid = 50225951
Trg + Lig
Ki
nM
ΔG°
kcal/mole
IC50
nM
Kd
nM
EC50/IC50
nM
koff
s-1
kon
M-1s-1
pHTemp
°C
Cholesterol side-chain cleavage enzyme, mitochondrial
(Rattus norvegicus)
BDBM50225951
(CHEMBL71636)
Show SMILES CC(C)CC(N)C(=O)NC(C)(C)P(O)(O)=O
Show InChI InChI=1S/C9H21N2O4P/c1-6(2)5-7(10)8(12)11-9(3,4)16(13,14)15/h6-7H,5,10H2,1-4H3,(H,11,12)(H2,13,14,15)
Reactome pathway
n/an/a 1.74E+4n/an/an/an/an/an/a
TBA
Curated by ChEMBL
Assay Description
Concentration (IC50) to inhibit the growth of Streptococcus faecalis.
J Med Chem 29: 2212-7 (1986)
BindingDB Entry DOI: 10.7270/Q27D2X9W