null
SMILES: CC(C)CC(N)C(=O)NC(CCC(O)=O)P(O)(O)=O
InChI Key: InChIKey=TYTUMDUXGAGYCB-UHFFFAOYSA-N
Activity Spreadsheet -- Enzyme Inhibition Constant Data from BindingDB
Found 1 hit for monomerid = 50225955
Trg + Lig
Ki
nM
ΔG°
kcal/mole
IC50
nM
Kd
nM
EC50/IC50
nM
koff
s-1
kon
M-1s-1
pHTemp
°C
Cholesterol side-chain cleavage enzyme, mitochondrial
(Rattus norvegicus)
BDBM50225955
(CHEMBL305291)
Show SMILES CC(C)CC(N)C(=O)NC(CCC(O)=O)P(O)(O)=O
Show InChI InChI=1S/C10H21N2O6P/c1-6(2)5-7(11)10(15)12-8(19(16,17)18)3-4-9(13)14/h6-8H,3-5,11H2,1-2H3,(H,12,15)(H,13,14)(H2,16,17,18)
Reactome pathway
n/an/a 1.08E+5n/an/an/an/an/an/a
TBA
Curated by ChEMBL
Assay Description
Concentration (IC50) to inhibit the growth of Streptococcus faecalis.
J Med Chem 29: 2212-7 (1986)
BindingDB Entry DOI: 10.7270/Q27D2X9W