null
SMILES: CC(C)C(NC(=O)C(C)N)P(O)(O)=O
InChI Key: InChIKey=VURPCHDBFCPYHA-UHFFFAOYSA-N
Activity Spreadsheet -- Enzyme Inhibition Constant Data from BindingDB
Found 1 hit for monomerid = 50225959
Trg + Lig
Ki
nM
ΔG°
kcal/mole
IC50
nM
Kd
nM
EC50/IC50
nM
koff
s-1
kon
M-1s-1
pHTemp
°C
Cholesterol side-chain cleavage enzyme, mitochondrial
(Rattus norvegicus)
BDBM50225959
(CHEMBL307316)
Show SMILES CC(C)C(NC(=O)C(C)N)P(O)(O)=O
Show InChI InChI=1S/C7H17N2O4P/c1-4(2)7(14(11,12)13)9-6(10)5(3)8/h4-5,7H,8H2,1-3H3,(H,9,10)(H2,11,12,13)
Reactome pathway
n/an/a 401n/an/an/an/an/an/a
TBA
Curated by ChEMBL
Assay Description
Concentration (IC50) to inhibit the growth of Streptococcus faecalis.
J Med Chem 29: 2212-7 (1986)
BindingDB Entry DOI: 10.7270/Q27D2X9W