BDBM50226005 3-(4-(2-methoxyethyl)morpholin-2-yl)phenol::CHEMBL398694
SMILES: COCCN1CCOC(C1)c1cccc(O)c1
InChI Key: InChIKey=OIEBMHRWPGYXOW-UHFFFAOYSA-N
Data: 2 EC50
Activity Spreadsheet -- Enzyme Inhibition Constant Data from BindingDB
Found 2 hits for monomerid = 50226005
Trg + Lig
Ki
nM
ΔG°
kcal/mole
IC50
nM
Kd
nM
EC50/IC50
nM
koff
s-1
kon
M-1s-1
pHTemp
°C
D(2) dopamine receptor
(Homo sapiens (Human))
BDBM50226005
(3-(4-(2-methoxyethyl)morpholin-2-yl)phenol | CHEMB...)
Show SMILES COCCN1CCOC(C1)c1cccc(O)c1 |w:8.10|
Show InChI InChI=1S/C13H19NO3/c1-16-7-5-14-6-8-17-13(10-14)11-3-2-4-12(15)9-11/h2-4,9,13,15H,5-8,10H2,1H3
Reactome pathway
n/an/an/an/a>1.00E+4n/an/an/an/a
Pfizer Global Research & Development
Curated by ChEMBL
Assay Description
Agonist activity at human recombinant dopamine D2 receptor expressed in rat pituitary cells assessed as inhibition of forskolin-stimulated cAMP accum...
Bioorg Med Chem Lett 17: 6691-6 (2007)
Article DOI: 10.1016/j.bmcl.2007.10.059
BindingDB Entry DOI: 10.7270/Q23J3CQ5
D(3) dopamine receptor
(Homo sapiens (Human))
BDBM50226005
(3-(4-(2-methoxyethyl)morpholin-2-yl)phenol | CHEMB...)
Show SMILES COCCN1CCOC(C1)c1cccc(O)c1 |w:8.10|
Show InChI InChI=1S/C13H19NO3/c1-16-7-5-14-6-8-17-13(10-14)11-3-2-4-12(15)9-11/h2-4,9,13,15H,5-8,10H2,1H3
n/an/an/an/a>3.00E+3n/an/an/an/a
Pfizer Global Research & Development
Curated by ChEMBL
Assay Description
Agonist activity at human recombinant dopamine D3 receptor expressed in CHO cells assessed as inhibition of forskolin-stimulated cAMP accumulation
Bioorg Med Chem Lett 17: 6691-6 (2007)
Article DOI: 10.1016/j.bmcl.2007.10.059
BindingDB Entry DOI: 10.7270/Q23J3CQ5