BDBM50226074 (1R)-2-((3R,4R)-3-amino-1-(chroman-4-yl)pyrrolidine-4-carbonyl)cyclopentanecarbonitrile::CHEMBL400533
SMILES: N[C@H]1CN(C[C@H]1C(=O)C1CCC[C@H]1C#N)C1CCOc2ccccc12
InChI Key: InChIKey=AXLLQKGXUYCBGM-CESNZTBESA-N
Data: 2 IC50
Activity Spreadsheet -- Enzyme Inhibition Constant Data from BindingDB
Found 2 hits for monomerid = 50226074
Trg + Lig
Ki
nM
ΔG°
kcal/mole
IC50
nM
Kd
nM
EC50/IC50
nM
koff
s-1
kon
M-1s-1
pHTemp
°C
Dipeptidyl peptidase VIII
(Homo sapiens (Human))
BDBM50226074
((1R)-2-((3R,4R)-3-amino-1-(chroman-4-yl)pyrrolidin...)
Show SMILES N[C@H]1CN(C[C@H]1C(=O)C1CCC[C@H]1C#N)C1CCOc2ccccc12 |w:8.8,15.16|
Show InChI InChI=1S/C20H25N3O2/c21-10-13-4-3-6-14(13)20(24)16-11-23(12-17(16)22)18-8-9-25-19-7-2-1-5-15(18)19/h1-2,5,7,13-14,16-18H,3-4,6,8-9,11-12,22H2/t13-,14?,16+,17-,18?/m0/s1
n/an/a 1.15E+6n/an/an/an/an/an/a
Pfizer Global Research and Development
Curated by ChEMBL
Assay Description
Inhibition of human DPP8
Bioorg Med Chem Lett 17: 6707-13 (2007)
Article DOI: 10.1016/j.bmcl.2007.10.063
BindingDB Entry DOI: 10.7270/Q2ZS2W8B
Dipeptidyl peptidase 4
(Homo sapiens (Human))
BDBM50226074
((1R)-2-((3R,4R)-3-amino-1-(chroman-4-yl)pyrrolidin...)
Show SMILES N[C@H]1CN(C[C@H]1C(=O)C1CCC[C@H]1C#N)C1CCOc2ccccc12 |w:8.8,15.16|
Show InChI InChI=1S/C20H25N3O2/c21-10-13-4-3-6-14(13)20(24)16-11-23(12-17(16)22)18-8-9-25-19-7-2-1-5-15(18)19/h1-2,5,7,13-14,16-18H,3-4,6,8-9,11-12,22H2/t13-,14?,16+,17-,18?/m0/s1
Reactome pathway
n/an/a 3.5n/an/an/an/an/an/a
Pfizer Global Research and Development
Curated by ChEMBL
Assay Description
Inhibition of human DPP4
Bioorg Med Chem Lett 17: 6707-13 (2007)
Article DOI: 10.1016/j.bmcl.2007.10.063
BindingDB Entry DOI: 10.7270/Q2ZS2W8B