BDBM50226114 CHEMBL392449::N-(2-aminophenyl)-4-((4-oxoquinazolin-3(4H)-yl)methyl)benzamide
SMILES: Nc1ccccc1NC(=O)c1ccc(Cn2cnc3ccccc3c2=O)cc1
InChI Key: InChIKey=IJAUCUHJKNNFJY-UHFFFAOYSA-N
Data: 1 IC50
Activity Spreadsheet -- Enzyme Inhibition Constant Data from BindingDB
Found 1 hit for monomerid = 50226114
Trg + Lig
Ki
nM
ΔG°
kcal/mole
IC50
nM
Kd
nM
EC50/IC50
nM
koff
s-1
kon
M-1s-1
pHTemp
°C
Histone deacetylase 1
(Homo sapiens (Human))
BDBM50226114
(CHEMBL392449 | N-(2-aminophenyl)-4-((4-oxoquinazol...)
Show SMILES Nc1ccccc1NC(=O)c1ccc(Cn2cnc3ccccc3c2=O)cc1
Show InChI InChI=1S/C22H18N4O2/c23-18-6-2-4-8-20(18)25-21(27)16-11-9-15(10-12-16)13-26-14-24-19-7-3-1-5-17(19)22(26)28/h1-12,14H,13,23H2,(H,25,27)
NCI pathway
Reactome pathway
n/an/a 100n/an/an/an/an/an/a
MethylGene Inc.
Curated by ChEMBL
Assay Description
Inhibition of human recombinant HDAC1 expressed in insect Sf9 cells
Bioorg Med Chem Lett 17: 6729-33 (2007)
Article DOI: 10.1016/j.bmcl.2007.10.050
BindingDB Entry DOI: 10.7270/Q2V124J9