BDBM50226163 CHEMBL410639::GLPEGG
SMILES: CC(C)C[C@H](NC(=O)CN)C(=O)N1CCC[C@H]1C(=O)N[C@@H](CCC(O)=O)C(=O)NCC(=O)NCC(O)=O
InChI Key: InChIKey=FNGWWCBQTADYCY-KKUMJFAQSA-N
Data: 2 IC50
Activity Spreadsheet -- Enzyme Inhibition Constant Data from BindingDB
Found 2 hits for monomerid = 50226163
Trg + Lig
Ki
nM
ΔG°
kcal/mole
IC50
nM
Kd
nM
EC50/IC50
nM
koff
s-1
kon
M-1s-1
pHTemp
°C
3-hydroxy-3-methylglutaryl-coenzyme A reductase
(Mesocricetus auratus)
BDBM50226163
(CHEMBL410639 | GLPEGG)
Show SMILES CC(C)C[C@H](NC(=O)CN)C(=O)N1CCC[C@H]1C(=O)N[C@@H](CCC(O)=O)C(=O)NCC(=O)NCC(O)=O
Show InChI InChI=1S/C22H36N6O9/c1-12(2)8-14(26-16(29)9-23)22(37)28-7-3-4-15(28)21(36)27-13(5-6-18(31)32)20(35)25-10-17(30)24-11-19(33)34/h12-15H,3-11,23H2,1-2H3,(H,24,30)(H,25,35)(H,26,29)(H,27,36)(H,31,32)(H,33,34)/t13-,14-,15-/m0/s1
n/an/a 2.72E+4n/an/an/an/an/an/a
Korea Food Research Institute
Curated by ChEMBL
Assay Description
Inhibition of Syrian hamster HMGR
Bioorg Med Chem 16: 1309-18 (2008)
Article DOI: 10.1016/j.bmc.2007.10.064
BindingDB Entry DOI: 10.7270/Q28P61D2
3-hydroxy-3-methylglutaryl-coenzyme A reductase
(Homo sapiens (Human))
BDBM50226163
(CHEMBL410639 | GLPEGG)
Show SMILES CC(C)C[C@H](NC(=O)CN)C(=O)N1CCC[C@H]1C(=O)N[C@@H](CCC(O)=O)C(=O)NCC(=O)NCC(O)=O
Show InChI InChI=1S/C22H36N6O9/c1-12(2)8-14(26-16(29)9-23)22(37)28-7-3-4-15(28)21(36)27-13(5-6-18(31)32)20(35)25-10-17(30)24-11-19(33)34/h12-15H,3-11,23H2,1-2H3,(H,24,30)(H,25,35)(H,26,29)(H,27,36)(H,31,32)(H,33,34)/t13-,14-,15-/m0/s1
n/an/a 2.73E+4n/an/an/an/an/an/a
Institute of the Chemistry of Plant Substances
Curated by ChEMBL
Assay Description
Inhibition of HMG-CoA reductase by spectrophotometry
Bioorg Med Chem 18: 4300-9 (2010)
Article DOI: 10.1016/j.bmc.2010.04.090
BindingDB Entry DOI: 10.7270/Q2VM4CFG