null
SMILES: COc1cccc(c1)-c1cccc(CC[C@@]2(C)CC(=O)N(C)C(N)=N2)c1
InChI Key: InChIKey=VDFBMQAUECXNKR-NRFANRHFSA-N
Activity Spreadsheet -- Enzyme Inhibition Constant Data from BindingDB
Found 1 hit for monomerid = 50226450
Trg + Lig
Ki
nM
ΔG°
kcal/mole
IC50
nM
Kd
nM
EC50/IC50
nM
koff
s-1
kon
M-1s-1
pHTemp
°C
Beta-secretase 1
(Homo sapiens (Human))
BDBM50226450
((S)-2-amino-6-[2-(3'-methoxybiphenyl-3-yl)ethyl]-3...)
Show SMILES COc1cccc(c1)-c1cccc(CC[C@@]2(C)CC(=O)N(C)C(N)=N2)c1 |c:24|
Show InChI InChI=1S/C21H25N3O2/c1-21(14-19(25)24(2)20(22)23-21)11-10-15-6-4-7-16(12-15)17-8-5-9-18(13-17)26-3/h4-9,12-13H,10-11,14H2,1-3H3,(H2,22,23)/t21-/m0/s1
n/an/a 3.50E+4n/an/an/an/an/an/a
AstraZeneca Pharmaceuticals LP
Curated by ChEMBL
Assay Description
Inhibition of BACE1 by FRET assay
J Med Chem 50: 5912-25 (2007)
Article DOI: 10.1021/jm070829p
BindingDB Entry DOI: 10.7270/Q2B27V0D