BDBM50226457 6-(3-(pyridin-3-yl)phenethyl)-2-amino-3-methylpyrimidin-4(3H)-one::CHEMBL235753
SMILES: Cn1c(N)nc(CCc2cccc(c2)-c2cccnc2)cc1=O
InChI Key: InChIKey=JKPVKTCZXDPUPX-UHFFFAOYSA-N
Data: 2 IC50
Activity Spreadsheet -- Enzyme Inhibition Constant Data from BindingDB
Found 2 hits for monomerid = 50226457
Trg + Lig
Ki
nM
ΔG°
kcal/mole
IC50
nM
Kd
nM
EC50/IC50
nM
koff
s-1
kon
M-1s-1
pHTemp
°C
Beta-secretase 1
(Homo sapiens (Human))
BDBM50226457
(6-(3-(pyridin-3-yl)phenethyl)-2-amino-3-methylpyri...)
Show SMILES Cn1c(N)nc(CCc2cccc(c2)-c2cccnc2)cc1=O
Show InChI InChI=1S/C18H18N4O/c1-22-17(23)11-16(21-18(22)19)8-7-13-4-2-5-14(10-13)15-6-3-9-20-12-15/h2-6,9-12H,7-8H2,1H3,(H2,19,21)
n/an/a 2.40E+4n/an/an/an/an/an/a
AstraZeneca Pharmaceuticals LP
Curated by ChEMBL
Assay Description
Inhibition of BACE1 by SPR assay
J Med Chem 50: 5912-25 (2007)
Article DOI: 10.1021/jm070829p
BindingDB Entry DOI: 10.7270/Q2B27V0D
Beta-secretase 1
(Homo sapiens (Human))
BDBM50226457
(6-(3-(pyridin-3-yl)phenethyl)-2-amino-3-methylpyri...)
Show SMILES Cn1c(N)nc(CCc2cccc(c2)-c2cccnc2)cc1=O
Show InChI InChI=1S/C18H18N4O/c1-22-17(23)11-16(21-18(22)19)8-7-13-4-2-5-14(10-13)15-6-3-9-20-12-15/h2-6,9-12H,7-8H2,1H3,(H2,19,21)
n/an/a 1.90E+5n/an/an/an/an/an/a
AstraZeneca Pharmaceuticals LP
Curated by ChEMBL
Assay Description
Inhibition of BACE1 by IGEN assay
J Med Chem 50: 5912-25 (2007)
Article DOI: 10.1021/jm070829p
BindingDB Entry DOI: 10.7270/Q2B27V0D