null
SMILES: COc1cccc(CCc2ccccc2OCC(O)CN(C)C)c1
InChI Key: InChIKey=VNRNJNRVACIMAP-UHFFFAOYSA-N
Activity Spreadsheet -- Enzyme Inhibition Constant Data from BindingDB
Found 2 hits for monomerid = 50227831
Trg + Lig
Ki
nM
ΔG°
kcal/mole
IC50
nM
Kd
nM
EC50/IC50
nM
koff
s-1
kon
M-1s-1
pHTemp
°C
5-hydroxytryptamine receptor 2A/2B/2C
(Rattus norvegicus (rat)-RAT-Rattus norvegicus (Rat...)
BDBM50227831
(CHEMBL52242)
Show SMILES COc1cccc(CCc2ccccc2OCC(O)CN(C)C)c1
Show InChI InChI=1S/C20H27NO3/c1-21(2)14-18(22)15-24-20-10-5-4-8-17(20)12-11-16-7-6-9-19(13-16)23-3/h4-10,13,18,22H,11-12,14-15H2,1-3H3
1.20n/an/an/an/an/an/an/an/a
Mitsubishi Kasei Corporation
Curated by ChEMBL
Assay Description
Inhibition of 5-hydroxytryptamine 2 induced vasoconstriction of rat caudal artery.
J Med Chem 33: 1818-23 (1990)
BindingDB Entry DOI: 10.7270/Q2FB5559
5-hydroxytryptamine receptor 2A/2B/2C
(Rattus norvegicus (rat)-RAT-Rattus norvegicus (Rat...)
BDBM50227831
(CHEMBL52242)
Show SMILES COc1cccc(CCc2ccccc2OCC(O)CN(C)C)c1
Show InChI InChI=1S/C20H27NO3/c1-21(2)14-18(22)15-24-20-10-5-4-8-17(20)12-11-16-7-6-9-19(13-16)23-3/h4-10,13,18,22H,11-12,14-15H2,1-3H3
n/an/a 13n/an/an/an/an/an/a
Mitsubishi Kasei Corporation
Curated by ChEMBL
Assay Description
Antagonistic activity against 5-hydroxytryptamine 2 receptor on rat frontal cortex membrane.
J Med Chem 33: 1818-23 (1990)
BindingDB Entry DOI: 10.7270/Q2FB5559