BDBM50228238 CHEMBL30911
SMILES: CO\C(O)=C1\C(C(C(=O)OCCN(C)CC2COc3ccccc3O2)=C(C)N=C1C)c1ccccc1[N+]([O-])=O
InChI Key: InChIKey=YPULZJXQBKVULX-SOYKGTTHSA-N
Data: 4 IC50
Activity Spreadsheet -- Enzyme Inhibition Constant Data from BindingDB
Found 4 hits for monomerid = 50228238
Trg + Lig
Ki
nM
ΔG°
kcal/mole
IC50
nM
Kd
nM
EC50/IC50
nM
koff
s-1
kon
M-1s-1
pHTemp
°C
Adrenergic receptor alpha-2
(Homo sapiens (Human))
BDBM50228238
(CHEMBL30911)
Show SMILES CO\C(O)=C1\C(C(C(=O)OCCN(C)CC2COc3ccccc3O2)=C(C)N=C1C)c1ccccc1[N+]([O-])=O |c:29,t:26|
Show InChI InChI=1S/C28H31N3O8/c1-17-24(27(32)36-4)26(20-9-5-6-10-21(20)31(34)35)25(18(2)29-17)28(33)37-14-13-30(3)15-19-16-38-22-11-7-8-12-23(22)39-19/h5-12,19,26,32H,13-16H2,1-4H3/b27-24+
n/an/a>1.00E+3n/an/an/an/an/an/a
Institut de Pharmacologie (UA 589 CNRS)
Curated by ChEMBL
Assay Description
In vitro ability to inhibit norepinephrine binding to alpha-2 adrenergic receptor of guinea pig vas deferens
J Med Chem 32: 1402-7 (1989)
BindingDB Entry DOI: 10.7270/Q2SQ92M9
Alpha-1 Adrenergic Receptor/ adrenergic receptor/ adrenergic receptor
(Rattus norvegicus (rat)-Rattus norvegicus (Rat))
BDBM50228238
(CHEMBL30911)
Show SMILES CO\C(O)=C1\C(C(C(=O)OCCN(C)CC2COc3ccccc3O2)=C(C)N=C1C)c1ccccc1[N+]([O-])=O |c:29,t:26|
Show InChI InChI=1S/C28H31N3O8/c1-17-24(27(32)36-4)26(20-9-5-6-10-21(20)31(34)35)25(18(2)29-17)28(33)37-14-13-30(3)15-19-16-38-22-11-7-8-12-23(22)39-19/h5-12,19,26,32H,13-16H2,1-4H3/b27-24+
Reactome pathway
n/an/a>1.00E+4n/an/an/an/an/an/a
Institut de Pharmacologie (UA 589 CNRS)
Curated by ChEMBL
Assay Description
Alpha-1-adrenolytic activity was assessed in vitro from the ability to inhibit clonidine binding to rat aorta preparation
J Med Chem 32: 1402-7 (1989)
BindingDB Entry DOI: 10.7270/Q2SQ92M9
Adrenergic receptor alpha-2
(RAT-NEONATAL RAT-Rattus norvegicus (rat))
BDBM50228238
(CHEMBL30911)
Show SMILES CO\C(O)=C1\C(C(C(=O)OCCN(C)CC2COc3ccccc3O2)=C(C)N=C1C)c1ccccc1[N+]([O-])=O |c:29,t:26|
Show InChI InChI=1S/C28H31N3O8/c1-17-24(27(32)36-4)26(20-9-5-6-10-21(20)31(34)35)25(18(2)29-17)28(33)37-14-13-30(3)15-19-16-38-22-11-7-8-12-23(22)39-19/h5-12,19,26,32H,13-16H2,1-4H3/b27-24+
n/an/a 270n/an/an/an/an/an/a
Institut de Pharmacologie (UA 589 CNRS)
Curated by ChEMBL
Assay Description
Ability to inhibit [3H]yohimbine binding to alpha-2 adrenergic receptor of rat cerebral cortex preparation
J Med Chem 32: 1402-7 (1989)
BindingDB Entry DOI: 10.7270/Q2SQ92M9
Alpha-1 Adrenergic Receptor/ adrenergic receptor/ adrenergic receptor
(Rattus norvegicus (rat)-Rattus norvegicus (Rat))
BDBM50228238
(CHEMBL30911)
Show SMILES CO\C(O)=C1\C(C(C(=O)OCCN(C)CC2COc3ccccc3O2)=C(C)N=C1C)c1ccccc1[N+]([O-])=O |c:29,t:26|
Show InChI InChI=1S/C28H31N3O8/c1-17-24(27(32)36-4)26(20-9-5-6-10-21(20)31(34)35)25(18(2)29-17)28(33)37-14-13-30(3)15-19-16-38-22-11-7-8-12-23(22)39-19/h5-12,19,26,32H,13-16H2,1-4H3/b27-24+
Reactome pathway
n/an/a 300n/an/an/an/an/an/a
Institut de Pharmacologie (UA 589 CNRS)
Curated by ChEMBL
Assay Description
Alpha-1-adrenolytic activity was assessed from the ability to inhibit [3H]prazosin binding to rat cerebral cortex preparation
J Med Chem 32: 1402-7 (1989)
BindingDB Entry DOI: 10.7270/Q2SQ92M9