BDBM50228308 CHEMBL413740
SMILES: CC1(C)SSC(C)(C)[C@H](NC(=O)[C@H](CCCN=C(N)N)NC(=O)[C@@H](N)CC(O)=O)C(=O)N[C@@H](Cc2ccc(O)cc2)C(=O)N[C@@H]1C(=O)N[C@@H](Cc1c[nH]cn1)C(=O)N1CCC[C@H]1C(=O)N[C@@H](Cc1ccccc1)C(O)=O
InChI Key: InChIKey=HIMIFRXDGSGVAB-RBUPEUJGSA-N
Data: 4 IC50
Activity Spreadsheet -- Enzyme Inhibition Constant Data from BindingDB
Found 4 hits for monomerid = 50228308
Trg + Lig
Ki
nM
ΔG°
kcal/mole
IC50
nM
Kd
nM
EC50/IC50
nM
koff
s-1
kon
M-1s-1
pHTemp
°C
Angiotensin II receptor (AT-1) type-1
(RAT)
BDBM50228308
(CHEMBL413740)
Show SMILES CC1(C)SSC(C)(C)[C@H](NC(=O)[C@H](CCCN=C(N)N)NC(=O)[C@@H](N)CC(O)=O)C(=O)N[C@@H](Cc2ccc(O)cc2)C(=O)N[C@@H]1C(=O)N[C@@H](Cc1c[nH]cn1)C(=O)N1CCC[C@H]1C(=O)N[C@@H](Cc1ccccc1)C(O)=O |wU:44.46,8.8,61.65,48.49,wD:65.68,32.32,23.23,12.12,(2.55,2.37,;2.49,1.14,;3.45,.38,;1.48,2.3,;,2.73,;-1.48,2.3,;-2.71,2.19,;-.86,3.37,;-2.49,1.14,;-3.89,1.78,;-4.04,3.32,;-3.03,4.03,;-5.44,3.96,;-6.7,3.07,;-8.09,3.72,;-9.35,2.83,;-10.75,3.47,;-12.01,2.58,;-13.13,3.1,;-11.9,1.36,;-5.58,5.49,;-6.98,6.14,;-7.98,5.42,;-7.12,7.67,;-6.12,8.38,;-8.53,8.31,;-8.67,9.84,;-7.67,10.56,;-9.79,10.36,;-2.71,-.39,;-3.93,-.56,;-2.07,-1.79,;-.77,-2.62,;-1.21,-4.1,;-2.71,-4.47,;-3.77,-3.35,;-5.27,-3.7,;-5.71,-5.18,;-6.9,-5.47,;-4.65,-6.3,;-3.15,-5.94,;.77,-2.62,;1.12,-3.8,;2.06,-1.79,;2.7,-.39,;4.24,-.6,;4.7,-1.75,;5.19,.61,;6.71,.39,;7.66,1.6,;7.09,3.03,;7.91,4.32,;6.93,5.5,;5.5,4.92,;5.6,3.39,;7.29,-1.04,;6.53,-2.01,;8.82,-1.25,;9.86,-.14,;11.25,-.81,;11.04,-2.34,;9.52,-2.61,;8.83,-3.98,;9.52,-5.01,;7.3,-4.08,;6.61,-5.46,;5.07,-5.56,;4.39,-6.94,;2.85,-7.03,;2.16,-8.42,;3.02,-9.7,;4.56,-9.6,;5.24,-8.22,;7.46,-6.75,;8.69,-6.67,;6.91,-7.85,)|
Show InChI InChI=1S/C49H67N13O12S2/c1-48(2)37(60-40(67)31(12-8-18-54-47(51)52)56-39(66)30(50)23-36(64)65)43(70)57-32(20-27-14-16-29(63)17-15-27)41(68)61-38(49(3,4)76-75-48)44(71)58-33(22-28-24-53-25-55-28)45(72)62-19-9-13-35(62)42(69)59-34(46(73)74)21-26-10-6-5-7-11-26/h5-7,10-11,14-17,24-25,30-35,37-38,63H,8-9,12-13,18-23,50H2,1-4H3,(H,53,55)(H,56,66)(H,57,70)(H,58,71)(H,59,69)(H,60,67)(H,61,68)(H,64,65)(H,73,74)(H4,51,52,54)/t30-,31-,32-,33-,34-,35-,37+,38+/m0/s1
n/an/a 2.60n/an/an/an/an/an/a
G. D. Searle and Company
Curated by ChEMBL
Assay Description
Concentration required to 50% inhibition in specific binding of [125- I]A-II to Angiotensin II receptor in rat uterine membrane
J Med Chem 33: 1935-40 (1990)
BindingDB Entry DOI: 10.7270/Q2R78D70
Angiotensin II receptor (AT-1) type-1
(RAT)
BDBM50228308
(CHEMBL413740)
Show SMILES CC1(C)SSC(C)(C)[C@H](NC(=O)[C@H](CCCN=C(N)N)NC(=O)[C@@H](N)CC(O)=O)C(=O)N[C@@H](Cc2ccc(O)cc2)C(=O)N[C@@H]1C(=O)N[C@@H](Cc1c[nH]cn1)C(=O)N1CCC[C@H]1C(=O)N[C@@H](Cc1ccccc1)C(O)=O |wU:44.46,8.8,61.65,48.49,wD:65.68,32.32,23.23,12.12,(2.55,2.37,;2.49,1.14,;3.45,.38,;1.48,2.3,;,2.73,;-1.48,2.3,;-2.71,2.19,;-.86,3.37,;-2.49,1.14,;-3.89,1.78,;-4.04,3.32,;-3.03,4.03,;-5.44,3.96,;-6.7,3.07,;-8.09,3.72,;-9.35,2.83,;-10.75,3.47,;-12.01,2.58,;-13.13,3.1,;-11.9,1.36,;-5.58,5.49,;-6.98,6.14,;-7.98,5.42,;-7.12,7.67,;-6.12,8.38,;-8.53,8.31,;-8.67,9.84,;-7.67,10.56,;-9.79,10.36,;-2.71,-.39,;-3.93,-.56,;-2.07,-1.79,;-.77,-2.62,;-1.21,-4.1,;-2.71,-4.47,;-3.77,-3.35,;-5.27,-3.7,;-5.71,-5.18,;-6.9,-5.47,;-4.65,-6.3,;-3.15,-5.94,;.77,-2.62,;1.12,-3.8,;2.06,-1.79,;2.7,-.39,;4.24,-.6,;4.7,-1.75,;5.19,.61,;6.71,.39,;7.66,1.6,;7.09,3.03,;7.91,4.32,;6.93,5.5,;5.5,4.92,;5.6,3.39,;7.29,-1.04,;6.53,-2.01,;8.82,-1.25,;9.86,-.14,;11.25,-.81,;11.04,-2.34,;9.52,-2.61,;8.83,-3.98,;9.52,-5.01,;7.3,-4.08,;6.61,-5.46,;5.07,-5.56,;4.39,-6.94,;2.85,-7.03,;2.16,-8.42,;3.02,-9.7,;4.56,-9.6,;5.24,-8.22,;7.46,-6.75,;8.69,-6.67,;6.91,-7.85,)|
Show InChI InChI=1S/C49H67N13O12S2/c1-48(2)37(60-40(67)31(12-8-18-54-47(51)52)56-39(66)30(50)23-36(64)65)43(70)57-32(20-27-14-16-29(63)17-15-27)41(68)61-38(49(3,4)76-75-48)44(71)58-33(22-28-24-53-25-55-28)45(72)62-19-9-13-35(62)42(69)59-34(46(73)74)21-26-10-6-5-7-11-26/h5-7,10-11,14-17,24-25,30-35,37-38,63H,8-9,12-13,18-23,50H2,1-4H3,(H,53,55)(H,56,66)(H,57,70)(H,58,71)(H,59,69)(H,60,67)(H,61,68)(H,64,65)(H,73,74)(H4,51,52,54)/t30-,31-,32-,33-,34-,35-,37+,38+/m0/s1
n/an/a 2.60n/an/an/an/an/an/a
Uppsala University
Curated by ChEMBL
Assay Description
Inhibitory concentration against specific binding of [125 I]Ang II to rat uterine membranes (Angiotensin II receptor, type 1)
J Med Chem 40: 903-19 (1997)
Article DOI: 10.1021/jm960553d
BindingDB Entry DOI: 10.7270/Q28S4SM4
Angiotensin II receptor (AT-1) type-1
(RAT)
BDBM50228308
(CHEMBL413740)
Show SMILES CC1(C)SSC(C)(C)[C@H](NC(=O)[C@H](CCCN=C(N)N)NC(=O)[C@@H](N)CC(O)=O)C(=O)N[C@@H](Cc2ccc(O)cc2)C(=O)N[C@@H]1C(=O)N[C@@H](Cc1c[nH]cn1)C(=O)N1CCC[C@H]1C(=O)N[C@@H](Cc1ccccc1)C(O)=O |wU:44.46,8.8,61.65,48.49,wD:65.68,32.32,23.23,12.12,(2.55,2.37,;2.49,1.14,;3.45,.38,;1.48,2.3,;,2.73,;-1.48,2.3,;-2.71,2.19,;-.86,3.37,;-2.49,1.14,;-3.89,1.78,;-4.04,3.32,;-3.03,4.03,;-5.44,3.96,;-6.7,3.07,;-8.09,3.72,;-9.35,2.83,;-10.75,3.47,;-12.01,2.58,;-13.13,3.1,;-11.9,1.36,;-5.58,5.49,;-6.98,6.14,;-7.98,5.42,;-7.12,7.67,;-6.12,8.38,;-8.53,8.31,;-8.67,9.84,;-7.67,10.56,;-9.79,10.36,;-2.71,-.39,;-3.93,-.56,;-2.07,-1.79,;-.77,-2.62,;-1.21,-4.1,;-2.71,-4.47,;-3.77,-3.35,;-5.27,-3.7,;-5.71,-5.18,;-6.9,-5.47,;-4.65,-6.3,;-3.15,-5.94,;.77,-2.62,;1.12,-3.8,;2.06,-1.79,;2.7,-.39,;4.24,-.6,;4.7,-1.75,;5.19,.61,;6.71,.39,;7.66,1.6,;7.09,3.03,;7.91,4.32,;6.93,5.5,;5.5,4.92,;5.6,3.39,;7.29,-1.04,;6.53,-2.01,;8.82,-1.25,;9.86,-.14,;11.25,-.81,;11.04,-2.34,;9.52,-2.61,;8.83,-3.98,;9.52,-5.01,;7.3,-4.08,;6.61,-5.46,;5.07,-5.56,;4.39,-6.94,;2.85,-7.03,;2.16,-8.42,;3.02,-9.7,;4.56,-9.6,;5.24,-8.22,;7.46,-6.75,;8.69,-6.67,;6.91,-7.85,)|
Show InChI InChI=1S/C49H67N13O12S2/c1-48(2)37(60-40(67)31(12-8-18-54-47(51)52)56-39(66)30(50)23-36(64)65)43(70)57-32(20-27-14-16-29(63)17-15-27)41(68)61-38(49(3,4)76-75-48)44(71)58-33(22-28-24-53-25-55-28)45(72)62-19-9-13-35(62)42(69)59-34(46(73)74)21-26-10-6-5-7-11-26/h5-7,10-11,14-17,24-25,30-35,37-38,63H,8-9,12-13,18-23,50H2,1-4H3,(H,53,55)(H,56,66)(H,57,70)(H,58,71)(H,59,69)(H,60,67)(H,61,68)(H,64,65)(H,73,74)(H4,51,52,54)/t30-,31-,32-,33-,34-,35-,37+,38+/m0/s1
n/an/a 0.900n/an/an/an/an/an/a
Uppsala University
Curated by ChEMBL
Assay Description
Inhibitory concentration against [125 I]Ang II binding to rat pituitary membranes Angiotensin II receptor type 1 without 0.2% bovine serum albumin
J Med Chem 40: 903-19 (1997)
Article DOI: 10.1021/jm960553d
BindingDB Entry DOI: 10.7270/Q28S4SM4
Angiotensin II receptor (AT-1) type-1
(RAT)
BDBM50228308
(CHEMBL413740)
Show SMILES CC1(C)SSC(C)(C)[C@H](NC(=O)[C@H](CCCN=C(N)N)NC(=O)[C@@H](N)CC(O)=O)C(=O)N[C@@H](Cc2ccc(O)cc2)C(=O)N[C@@H]1C(=O)N[C@@H](Cc1c[nH]cn1)C(=O)N1CCC[C@H]1C(=O)N[C@@H](Cc1ccccc1)C(O)=O |wU:44.46,8.8,61.65,48.49,wD:65.68,32.32,23.23,12.12,(2.55,2.37,;2.49,1.14,;3.45,.38,;1.48,2.3,;,2.73,;-1.48,2.3,;-2.71,2.19,;-.86,3.37,;-2.49,1.14,;-3.89,1.78,;-4.04,3.32,;-3.03,4.03,;-5.44,3.96,;-6.7,3.07,;-8.09,3.72,;-9.35,2.83,;-10.75,3.47,;-12.01,2.58,;-13.13,3.1,;-11.9,1.36,;-5.58,5.49,;-6.98,6.14,;-7.98,5.42,;-7.12,7.67,;-6.12,8.38,;-8.53,8.31,;-8.67,9.84,;-7.67,10.56,;-9.79,10.36,;-2.71,-.39,;-3.93,-.56,;-2.07,-1.79,;-.77,-2.62,;-1.21,-4.1,;-2.71,-4.47,;-3.77,-3.35,;-5.27,-3.7,;-5.71,-5.18,;-6.9,-5.47,;-4.65,-6.3,;-3.15,-5.94,;.77,-2.62,;1.12,-3.8,;2.06,-1.79,;2.7,-.39,;4.24,-.6,;4.7,-1.75,;5.19,.61,;6.71,.39,;7.66,1.6,;7.09,3.03,;7.91,4.32,;6.93,5.5,;5.5,4.92,;5.6,3.39,;7.29,-1.04,;6.53,-2.01,;8.82,-1.25,;9.86,-.14,;11.25,-.81,;11.04,-2.34,;9.52,-2.61,;8.83,-3.98,;9.52,-5.01,;7.3,-4.08,;6.61,-5.46,;5.07,-5.56,;4.39,-6.94,;2.85,-7.03,;2.16,-8.42,;3.02,-9.7,;4.56,-9.6,;5.24,-8.22,;7.46,-6.75,;8.69,-6.67,;6.91,-7.85,)|
Show InChI InChI=1S/C49H67N13O12S2/c1-48(2)37(60-40(67)31(12-8-18-54-47(51)52)56-39(66)30(50)23-36(64)65)43(70)57-32(20-27-14-16-29(63)17-15-27)41(68)61-38(49(3,4)76-75-48)44(71)58-33(22-28-24-53-25-55-28)45(72)62-19-9-13-35(62)42(69)59-34(46(73)74)21-26-10-6-5-7-11-26/h5-7,10-11,14-17,24-25,30-35,37-38,63H,8-9,12-13,18-23,50H2,1-4H3,(H,53,55)(H,56,66)(H,57,70)(H,58,71)(H,59,69)(H,60,67)(H,61,68)(H,64,65)(H,73,74)(H4,51,52,54)/t30-,31-,32-,33-,34-,35-,37+,38+/m0/s1
n/an/a 3.80n/an/an/an/an/an/a
Uppsala University
Curated by ChEMBL
Assay Description
Inhibitory concentration against specific binding of [125 I]Ang II to rat pituitary membranes (Angiotensin II receptor, type 1) in presence of 0.2% b...
J Med Chem 40: 903-19 (1997)
Article DOI: 10.1021/jm960553d
BindingDB Entry DOI: 10.7270/Q28S4SM4