null
SMILES: CCOC(=O)N1[C@@H](\C(=C(/O)OC(C)C)C(C)=NC1=S)c1cccc(c1)[N+]([O-])=O
InChI Key: InChIKey=MNQUJICKNQOWHX-DPEHCCBOSA-N
Activity Spreadsheet -- Enzyme Inhibition Constant Data from BindingDB
Found 1 hit for monomerid = 50228807
Trg + Lig
Ki
nM
ΔG°
kcal/mole
IC50
nM
Kd
nM
EC50/IC50
nM
koff
s-1
kon
M-1s-1
pHTemp
°C
Voltage-dependent L-type calcium channel subunit alpha-1C/alpha-1D/alpha-1F/alpha-1S
(Homo sapiens (Human))
BDBM50228807
(CHEMBL2092901)
Show SMILES CCOC(=O)N1[C@@H](\C(=C(/O)OC(C)C)C(C)=NC1=S)c1cccc(c1)[N+]([O-])=O |r,c:15|
Show InChI InChI=1S/C18H21N3O6S/c1-5-26-18(23)20-15(12-7-6-8-13(9-12)21(24)25)14(11(4)19-17(20)28)16(22)27-10(2)3/h6-10,15,22H,5H2,1-4H3/b16-14+/t15-/m1/s1
n/an/a 2n/an/an/an/an/an/a
Squibb Institute for Medical Research
Curated by ChEMBL
Assay Description
In vitro vasorelaxant activity (calcium channel blocking activity) was determined with potassium-depolarized rabbit thoracic aorta
J Med Chem 33: 2629-35 (1990)
BindingDB Entry DOI: 10.7270/Q2XD13XV