BDBM50229218 2-(4-{[2-(4'-chloro-biphenyl-4-yl)-acetylamino]-methyl}-phenoxy)-2-metyl-propionic acid::CHEMBL253924
SMILES: CC(C)(Oc1ccc(CNC(=O)Cc2ccc(cc2)-c2ccc(Cl)cc2)cc1)C(O)=O
InChI Key: InChIKey=XJHZTSUBHUYMGE-UHFFFAOYSA-N
Data: 2 EC50
Activity Spreadsheet -- Enzyme Inhibition Constant Data from BindingDB
Found 2 hits for monomerid = 50229218
Trg + Lig
Ki
nM
ΔG°
kcal/mole
IC50
nM
Kd
nM
EC50/IC50
nM
koff
s-1
kon
M-1s-1
pHTemp
°C
Peroxisome proliferator-activated receptor alpha
(Mus musculus)
BDBM50229218
(2-(4-{[2-(4'-chloro-biphenyl-4-yl)-acetylamino]-me...)
Show SMILES CC(C)(Oc1ccc(CNC(=O)Cc2ccc(cc2)-c2ccc(Cl)cc2)cc1)C(O)=O
Show InChI InChI=1S/C25H24ClNO4/c1-25(2,24(29)30)31-22-13-5-18(6-14-22)16-27-23(28)15-17-3-7-19(8-4-17)20-9-11-21(26)12-10-20/h3-14H,15-16H2,1-2H3,(H,27,28)(H,29,30)
Reactome pathway
n/an/an/an/a>2.50E+4n/an/an/an/a
Centre de Recherches
Curated by ChEMBL
Assay Description
Agonist activity at mouse PPARalpha assessed as receptor activation by cell based assay
Bioorg Med Chem Lett 18: 710-5 (2008)
Article DOI: 10.1016/j.bmcl.2007.11.053
BindingDB Entry DOI: 10.7270/Q2542NBN
Peroxisome proliferator-activated receptor alpha
(Homo sapiens (Human))
BDBM50229218
(2-(4-{[2-(4'-chloro-biphenyl-4-yl)-acetylamino]-me...)
Show SMILES CC(C)(Oc1ccc(CNC(=O)Cc2ccc(cc2)-c2ccc(Cl)cc2)cc1)C(O)=O
Show InChI InChI=1S/C25H24ClNO4/c1-25(2,24(29)30)31-22-13-5-18(6-14-22)16-27-23(28)15-17-3-7-19(8-4-17)20-9-11-21(26)12-10-20/h3-14H,15-16H2,1-2H3,(H,27,28)(H,29,30)
n/an/an/an/a 2.80E+3n/an/an/an/a
Centre de Recherches
Curated by ChEMBL
Assay Description
Agonist activity at human PPARalpha assessed as receptor activation by cell based assay
Bioorg Med Chem Lett 18: 710-5 (2008)
Article DOI: 10.1016/j.bmcl.2007.11.053
BindingDB Entry DOI: 10.7270/Q2542NBN