BDBM50229535 CHEMBL91390
SMILES: [H][C@@]12C[N@@](C[C@H]1c1nc(C)no1)CCC2
InChI Key: InChIKey=JGHBDPNRNBBJPC-RKDXNWHRSA-N
Data: 2 IC50
Activity Spreadsheet -- Enzyme Inhibition Constant Data from BindingDB
Found 2 hits for monomerid = 50229535
Trg + Lig
Ki
nM
ΔG°
kcal/mole
IC50
nM
Kd
nM
EC50/IC50
nM
koff
s-1
kon
M-1s-1
pHTemp
°C
Muscarinic acetylcholine receptor
(RAT)
BDBM50229535
(CHEMBL91390)
Show SMILES [H][C@@]12C[N@@](C[C@H]1c1nc(C)no1)CCC2
Show InChI InChI=1S/C10H15N3O/c1-7-11-10(14-12-7)9-6-13-4-2-3-8(9)5-13/h8-9H,2-6H2,1H3/t8-,9-/m1/s1
NCI pathway
Reactome pathway
n/an/a 44n/an/an/an/an/an/a
SmithKline Beecham Pharmaceuticals
Curated by ChEMBL
Assay Description
The compound was tested in vitro for central muscarinic acetylcholine receptor affinity to displace [3H]oxotremorine-M from rat cerebral cortex; Valu...
J Med Chem 34: 2726-35 (1991)
BindingDB Entry DOI: 10.7270/Q2BG2R7J
Muscarinic acetylcholine receptor
(RAT)
BDBM50229535
(CHEMBL91390)
Show SMILES [H][C@@]12C[N@@](C[C@H]1c1nc(C)no1)CCC2
Show InChI InChI=1S/C10H15N3O/c1-7-11-10(14-12-7)9-6-13-4-2-3-8(9)5-13/h8-9H,2-6H2,1H3/t8-,9-/m1/s1
NCI pathway
Reactome pathway
n/an/a 2.40E+3n/an/an/an/an/an/a
SmithKline Beecham Pharmaceuticals
Curated by ChEMBL
Assay Description
The compound was tested in vitro for central muscarinic acetylcholine receptor affinity to displace [3H]quinuclidinyl benzilate from rat cerebral cor...
J Med Chem 34: 2726-35 (1991)
BindingDB Entry DOI: 10.7270/Q2BG2R7J