BDBM50229702 CHEMBL4101314
SMILES: CCC(C)(C)C(=O)N(C)Cc1cccc(F)c1F
InChI Key: InChIKey=UJAJXMGIMOOOIH-UHFFFAOYSA-N
Data: 1 EC50
Activity Spreadsheet -- Enzyme Inhibition Constant Data from BindingDB
Found 1 hit for monomerid = 50229702
Trg + Lig
Ki
nM
ΔG°
kcal/mole
IC50
nM
Kd
nM
EC50/IC50
nM
koff
s-1
kon
M-1s-1
pHTemp
°C
Receptor-interacting serine/threonine-protein kinase 1
(Homo sapiens (Human))
BDBM50229702
(CHEMBL4101314)
Show SMILES CCC(C)(C)C(=O)N(C)Cc1cccc(F)c1F
Show InChI InChI=1S/C14H19F2NO/c1-5-14(2,3)13(18)17(4)9-10-7-6-8-11(15)12(10)16/h6-8H,5,9H2,1-4H3
n/an/an/an/a 58n/an/an/an/a
National Institute of Biological Sciences
Curated by ChEMBL
Assay Description
Inhibition of RIP1 in human HT-29 cells assessed as reduction in TNFalpha/z-VAD-FMK-induced necrosis after 24 hrs by Cell Titer-Glo luminescent cell ...
J Med Chem 60: 972-986 (2017)
BindingDB Entry DOI: 10.7270/Q2QC05QD