BDBM50229879 CHEMBL430685
SMILES: CNc1nccn2c(Br)cnc12
InChI Key: InChIKey=IYPYESRWCUEMDJ-UHFFFAOYSA-N
Data: 1 IC50
Activity Spreadsheet -- Enzyme Inhibition Constant Data from BindingDB
Found 1 hit for monomerid = 50229879
Trg + Lig
Ki
nM
ΔG°
kcal/mole
IC50
nM
Kd
nM
EC50/IC50
nM
koff
s-1
kon
M-1s-1
pHTemp
°C
Calcium/calmodulin-dependent 3',5'-cyclic nucleotide phosphodiesterase 1B
(Bos taurus)
BDBM50229879
(CHEMBL430685)
Show SMILES CNc1nccn2c(Br)cnc12
Show InChI InChI=1S/C7H7BrN4/c1-9-6-7-11-4-5(8)12(7)3-2-10-6/h2-4H,1H3,(H,9,10)
n/an/a 3.37E+5n/an/an/an/an/an/a
URA CNRS 1111
Curated by ChEMBL
Assay Description
Inhibition of Shh signaling in mouse Shh-light2 cells by Gli-dependent firefly luciferase reporter gene assay
J Med Chem 35: 3353-8 (1992)
BindingDB Entry DOI: 10.7270/Q21Z46N3