BDBM50229880 CHEMBL116115
SMILES: CCNc1nc(Br)cn2ccnc12
InChI Key: InChIKey=STIRLFBTSNDDBZ-UHFFFAOYSA-N
Data: 1 IC50
Activity Spreadsheet -- Enzyme Inhibition Constant Data from BindingDB
Found 1 hit for monomerid = 50229880
Trg + Lig
Ki
nM
ΔG°
kcal/mole
IC50
nM
Kd
nM
EC50/IC50
nM
koff
s-1
kon
M-1s-1
pHTemp
°C
Calcium/calmodulin-dependent 3',5'-cyclic nucleotide phosphodiesterase 1B
(Bos taurus)
BDBM50229880
(CHEMBL116115)
Show SMILES CCNc1nc(Br)cn2ccnc12
Show InChI InChI=1S/C8H9BrN4/c1-2-10-7-8-11-3-4-13(8)5-6(9)12-7/h3-5H,2H2,1H3,(H,10,12)
n/an/a 8.10E+4n/an/an/an/an/an/a
URA CNRS 1111
Curated by ChEMBL
Assay Description
Inhibition of Shh signaling in mouse Shh-light2 cells by Gli-dependent firefly luciferase reporter gene assay
J Med Chem 35: 3353-8 (1992)
BindingDB Entry DOI: 10.7270/Q21Z46N3