BDBM50229925 CHEMBL433408
SMILES: [H][C@](N)(CCCCN)C(=O)NCC1CCCCN1C(=O)CCCCCCCCCCC
InChI Key: InChIKey=WHPRQTVQTQRFCS-KEKNWZKVSA-N
Data: 1 IC50
Activity Spreadsheet -- Enzyme Inhibition Constant Data from BindingDB
Found 1 hit for monomerid = 50229925
Trg + Lig
Ki
nM
ΔG°
kcal/mole
IC50
nM
Kd
nM
EC50/IC50
nM
koff
s-1
kon
M-1s-1
pHTemp
°C
Protein kinase C, PKC; classical
(Rattus norvegicus (Rat)-Rattus norvegicus (rat))
BDBM50229925
(CHEMBL433408)
Show SMILES [H][C@](N)(CCCCN)C(=O)NCC1CCCCN1C(=O)CCCCCCCCCCC
Show InChI InChI=1S/C24H48N4O2/c1-2-3-4-5-6-7-8-9-10-17-23(29)28-19-14-12-15-21(28)20-27-24(30)22(26)16-11-13-18-25/h21-22H,2-20,25-26H2,1H3,(H,27,30)/t21?,22-/m0/s1
n/an/a 1.02E+5n/an/an/an/an/an/a
Nova Pharmaceutical Corporation
Curated by ChEMBL
Assay Description
In vitro inhibition of [32P] incorporation into histones by rat brain partially purified Protein kinase C in the presence of PMA, [Ca2+] and phosphat...
J Med Chem 34: 2928-31 (1991)
BindingDB Entry DOI: 10.7270/Q2KH0NZG