BDBM50230185 CHEMBL4104599
SMILES: Nc1n[nH]c2cccc(-c3ccc(NC(=O)C4(CC4)C(=O)Nc4ccc(Br)cc4OC(F)(F)F)cc3)c12
InChI Key: InChIKey=VDJMIERKUPUGPE-UHFFFAOYSA-N
Data: 3 IC50
Activity Spreadsheet -- Enzyme Inhibition Constant Data from BindingDB
Found 3 hits for monomerid = 50230185
Trg + Lig
Ki
nM
ΔG°
kcal/mole
IC50
nM
Kd
nM
EC50/IC50
nM
koff
s-1
kon
M-1s-1
pHTemp
°C
Vascular endothelial growth factor receptor 2
(Homo sapiens (Human))
BDBM50230185
(CHEMBL4104599)
Show SMILES Nc1n[nH]c2cccc(-c3ccc(NC(=O)C4(CC4)C(=O)Nc4ccc(Br)cc4OC(F)(F)F)cc3)c12
Show InChI InChI=1S/C25H19BrF3N5O3/c26-14-6-9-17(19(12-14)37-25(27,28)29)32-23(36)24(10-11-24)22(35)31-15-7-4-13(5-8-15)16-2-1-3-18-20(16)21(30)34-33-18/h1-9,12H,10-11H2,(H,31,35)(H,32,36)(H3,30,33,34)
NCI pathway
Reactome pathway
n/an/a 5.60n/an/an/an/an/an/a
Xi'an Jiaotong University
Curated by ChEMBL
Assay Description
Inhibition of VEGFR2 (unknown origin) after 60 mins by ADP-Glo assay
Eur J Med Chem 127: 275-285 (2017)
BindingDB Entry DOI: 10.7270/Q2XW4N27
Angiopoietin-1 receptor
(Homo sapiens (Human))
BDBM50230185
(CHEMBL4104599)
Show SMILES Nc1n[nH]c2cccc(-c3ccc(NC(=O)C4(CC4)C(=O)Nc4ccc(Br)cc4OC(F)(F)F)cc3)c12
Show InChI InChI=1S/C25H19BrF3N5O3/c26-14-6-9-17(19(12-14)37-25(27,28)29)32-23(36)24(10-11-24)22(35)31-15-7-4-13(5-8-15)16-2-1-3-18-20(16)21(30)34-33-18/h1-9,12H,10-11H2,(H,31,35)(H,32,36)(H3,30,33,34)
n/an/a 134n/an/an/an/an/an/a
Xi'an Jiaotong University
Curated by ChEMBL
Assay Description
Inhibition of TIE-2 (unknown origin) after 60 mins by ADP-Glo assay
Eur J Med Chem 127: 275-285 (2017)
BindingDB Entry DOI: 10.7270/Q2XW4N27
Ephrin type-B receptor 4
(Homo sapiens (Human))
BDBM50230185
(CHEMBL4104599)
Show SMILES Nc1n[nH]c2cccc(-c3ccc(NC(=O)C4(CC4)C(=O)Nc4ccc(Br)cc4OC(F)(F)F)cc3)c12
Show InChI InChI=1S/C25H19BrF3N5O3/c26-14-6-9-17(19(12-14)37-25(27,28)29)32-23(36)24(10-11-24)22(35)31-15-7-4-13(5-8-15)16-2-1-3-18-20(16)21(30)34-33-18/h1-9,12H,10-11H2,(H,31,35)(H,32,36)(H3,30,33,34)
Reactome pathway
n/an/a 4.5n/an/an/an/an/an/a
Xi'an Jiaotong University
Curated by ChEMBL
Assay Description
Inhibition of EphB4 (unknown origin) after 60 mins by ADP-Glo assay
Eur J Med Chem 127: 275-285 (2017)
BindingDB Entry DOI: 10.7270/Q2XW4N27