BDBM50230294 CHEMBL4071740
SMILES: CO[C@@H]1CC\C=C\c2cccc(c2)[C@@H](C)OC(=O)[C@@H]2CCCN(N2)C(=O)[C@H](Cc2cccc(O)c2)NC(=O)[C@@H](NC(=O)[C@@H]1C)C(C)C
InChI Key: InChIKey=SDVRVWXKFPHKSR-IBVKFTFISA-N
Data: 1 KI  1 Kd
PDB links: 1 PDB ID matches this monomer.
Activity Spreadsheet -- Enzyme Inhibition Constant Data from BindingDB
Found 2 hits for monomerid = 50230294
Trg + Lig
Ki
nM
ΔG°
kcal/mole
IC50
nM
Kd
nM
EC50/IC50
nM
koff
s-1
kon
M-1s-1
pHTemp
°C
Peptidyl-prolyl cis-trans isomerase A
(Homo sapiens (Human))
BDBM50230294
(CHEMBL4071740)
Show SMILES CO[C@@H]1CC\C=C\c2cccc(c2)[C@@H](C)OC(=O)[C@@H]2CCCN(N2)C(=O)[C@H](Cc2cccc(O)c2)NC(=O)[C@@H](NC(=O)[C@@H]1C)C(C)C |r,t:5|
Show InChI InChI=1S/C36H48N4O7/c1-22(2)32-34(43)37-30(21-26-13-9-15-28(41)20-26)35(44)40-18-10-16-29(39-40)36(45)47-24(4)27-14-8-12-25(19-27)11-6-7-17-31(46-5)23(3)33(42)38-32/h6,8-9,11-15,19-20,22-24,29-32,39,41H,7,10,16-18,21H2,1-5H3,(H,37,43)(H,38,42)/b11-6+/t23-,24-,29+,30+,31-,32+/m1/s1
Reactome pathway
4n/an/an/an/an/an/an/an/a
Selcia Ltd.
Curated by ChEMBL
Assay Description
Inhibition of full length recombinant human N-terminal His8-tagged Cyclophilin A (1 to 169 residues) expressed in Escherichia coli BL21(DE3) using Su...
J Med Chem 60: 1000-1017 (2017)
BindingDB Entry DOI: 10.7270/Q2JQ137K
3D
3D Structure (crystal)
Peptidyl-prolyl cis-trans isomerase A
(Homo sapiens (Human))
BDBM50230294
(CHEMBL4071740)
Show SMILES CO[C@@H]1CC\C=C\c2cccc(c2)[C@@H](C)OC(=O)[C@@H]2CCCN(N2)C(=O)[C@H](Cc2cccc(O)c2)NC(=O)[C@@H](NC(=O)[C@@H]1C)C(C)C |r,t:5|
Show InChI InChI=1S/C36H48N4O7/c1-22(2)32-34(43)37-30(21-26-13-9-15-28(41)20-26)35(44)40-18-10-16-29(39-40)36(45)47-24(4)27-14-8-12-25(19-27)11-6-7-17-31(46-5)23(3)33(42)38-32/h6,8-9,11-15,19-20,22-24,29-32,39,41H,7,10,16-18,21H2,1-5H3,(H,37,43)(H,38,42)/b11-6+/t23-,24-,29+,30+,31-,32+/m1/s1
Reactome pathway
n/an/an/a 11n/an/an/an/an/a
Selcia Ltd.
Curated by ChEMBL
Assay Description
Inhibition of Cy5-labeled cyclosporin A binding to full length recombinant human N-terminal His8-tagged Cyclophilin A (1 to 169 residues) expressed i...
J Med Chem 60: 1000-1017 (2017)
BindingDB Entry DOI: 10.7270/Q2JQ137K
3D
3D Structure (crystal)