BDBM50230370 CHEMBL4097409
SMILES: N\C(=N\C(=N/S(=O)(=O)c1ccc(Cl)cc1)\N1CC(C(=N1)c1ccc(Cl)cc1)c1ccccc1)c1ccc(Cl)cc1
InChI Key: InChIKey=UAFSZWRCJFMEBV-UHFFFAOYSA-N
Data: 2 KI  1 IC50
Activity Spreadsheet -- Enzyme Inhibition Constant Data from BindingDB
Found 3 hits for monomerid = 50230370
Trg + Lig
Ki
nM
ΔG°
kcal/mole
IC50
nM
Kd
nM
EC50/IC50
nM
koff
s-1
kon
M-1s-1
pHTemp
°C
Cannabinoid receptor 1
(Mus musculus (Mouse))
BDBM50230370
(CHEMBL4097409)
Show SMILES N\C(=N\C(=N/S(=O)(=O)c1ccc(Cl)cc1)\N1CC(C(=N1)c1ccc(Cl)cc1)c1ccccc1)c1ccc(Cl)cc1 |c:19|
Show InChI InChI=1S/C29H22Cl3N5O2S/c30-22-10-6-20(7-11-22)27-26(19-4-2-1-3-5-19)18-37(35-27)29(34-28(33)21-8-12-23(31)13-9-21)36-40(38,39)25-16-14-24(32)15-17-25/h1-17,26H,18H2,(H2,33,34,36)
10n/an/an/an/an/an/an/an/a
National Institute on Alcohol Abuse and Alcoholism
Curated by ChEMBL
Assay Description
Displacement of [3H]CP55940 from mouse brain CB1R expressed in CHOK1 cell membranes
J Med Chem 60: 1126-1141 (2017)
BindingDB Entry DOI: 10.7270/Q2WW7KXF
Cannabinoid receptor 2
(MOUSE)
BDBM50230370
(CHEMBL4097409)
Show SMILES N\C(=N\C(=N/S(=O)(=O)c1ccc(Cl)cc1)\N1CC(C(=N1)c1ccc(Cl)cc1)c1ccccc1)c1ccc(Cl)cc1 |c:19|
Show InChI InChI=1S/C29H22Cl3N5O2S/c30-22-10-6-20(7-11-22)27-26(19-4-2-1-3-5-19)18-37(35-27)29(34-28(33)21-8-12-23(31)13-9-21)36-40(38,39)25-16-14-24(32)15-17-25/h1-17,26H,18H2,(H2,33,34,36)
Reactome pathway
158n/an/an/an/an/an/an/an/a
National Institute on Alcohol Abuse and Alcoholism
Curated by ChEMBL
Assay Description
Displacement of [3H]CP55940 from mouse CB2R expressed in CHOK1 cell membranes
J Med Chem 60: 1126-1141 (2017)
BindingDB Entry DOI: 10.7270/Q2WW7KXF
Cannabinoid receptor 1
(Mus musculus (Mouse))
BDBM50230370
(CHEMBL4097409)
Show SMILES N\C(=N\C(=N/S(=O)(=O)c1ccc(Cl)cc1)\N1CC(C(=N1)c1ccc(Cl)cc1)c1ccccc1)c1ccc(Cl)cc1 |c:19|
Show InChI InChI=1S/C29H22Cl3N5O2S/c30-22-10-6-20(7-11-22)27-26(19-4-2-1-3-5-19)18-37(35-27)29(34-28(33)21-8-12-23(31)13-9-21)36-40(38,39)25-16-14-24(32)15-17-25/h1-17,26H,18H2,(H2,33,34,36)
n/an/a 18n/an/an/an/an/an/a
National Institute on Alcohol Abuse and Alcoholism
Curated by ChEMBL
Assay Description
Inverse agonist at mouse brain CB1R expressed in CHOK1 cell membranes assessed as inhibition of CP55940-stimulated [35S]GTP-gammaS binding measured a...
J Med Chem 60: 1126-1141 (2017)
BindingDB Entry DOI: 10.7270/Q2WW7KXF