BDBM50230400 CHEMBL4103562
SMILES: CS\C(N)=N/C(=N\S(=O)(=O)c1ccc(cc1)C(F)(F)F)/N1CC(C(=N1)c1ccc(Cl)cc1)c1ccccc1
InChI Key: InChIKey=FTGCSCGERPAADR-UHFFFAOYSA-N
Data: 2 KI  1 IC50
Activity Spreadsheet -- Enzyme Inhibition Constant Data from BindingDB
Found 3 hits for monomerid = 50230400
Trg + Lig
Ki
nM
ΔG°
kcal/mole
IC50
nM
Kd
nM
EC50/IC50
nM
koff
s-1
kon
M-1s-1
pHTemp
°C
Cannabinoid receptor 1
(Mus musculus (Mouse))
BDBM50230400
(CHEMBL4103562)
Show SMILES CS\C(N)=N/C(=N\S(=O)(=O)c1ccc(cc1)C(F)(F)F)/N1CC(C(=N1)c1ccc(Cl)cc1)c1ccccc1 |c:24|
Show InChI InChI=1S/C25H21ClF3N5O2S2/c1-37-23(30)31-24(33-38(35,36)20-13-9-18(10-14-20)25(27,28)29)34-15-21(16-5-3-2-4-6-16)22(32-34)17-7-11-19(26)12-8-17/h2-14,21H,15H2,1H3,(H2,30,31,33)
63n/an/an/an/an/an/an/an/a
National Institute on Alcohol Abuse and Alcoholism
Curated by ChEMBL
Assay Description
Displacement of [3H]CP55940 from mouse brain CB1R expressed in CHOK1 cell membranes
J Med Chem 60: 1126-1141 (2017)
BindingDB Entry DOI: 10.7270/Q2WW7KXF
Cannabinoid receptor 2
(MOUSE)
BDBM50230400
(CHEMBL4103562)
Show SMILES CS\C(N)=N/C(=N\S(=O)(=O)c1ccc(cc1)C(F)(F)F)/N1CC(C(=N1)c1ccc(Cl)cc1)c1ccccc1 |c:24|
Show InChI InChI=1S/C25H21ClF3N5O2S2/c1-37-23(30)31-24(33-38(35,36)20-13-9-18(10-14-20)25(27,28)29)34-15-21(16-5-3-2-4-6-16)22(32-34)17-7-11-19(26)12-8-17/h2-14,21H,15H2,1H3,(H2,30,31,33)
Reactome pathway
>1.00E+3n/an/an/an/an/an/an/an/a
National Institute on Alcohol Abuse and Alcoholism
Curated by ChEMBL
Assay Description
Displacement of [3H]CP55940 from mouse CB2R expressed in CHOK1 cell membranes
J Med Chem 60: 1126-1141 (2017)
BindingDB Entry DOI: 10.7270/Q2WW7KXF
Cannabinoid receptor 1
(Mus musculus (Mouse))
BDBM50230400
(CHEMBL4103562)
Show SMILES CS\C(N)=N/C(=N\S(=O)(=O)c1ccc(cc1)C(F)(F)F)/N1CC(C(=N1)c1ccc(Cl)cc1)c1ccccc1 |c:24|
Show InChI InChI=1S/C25H21ClF3N5O2S2/c1-37-23(30)31-24(33-38(35,36)20-13-9-18(10-14-20)25(27,28)29)34-15-21(16-5-3-2-4-6-16)22(32-34)17-7-11-19(26)12-8-17/h2-14,21H,15H2,1H3,(H2,30,31,33)
n/an/a 97n/an/an/an/an/an/a
National Institute on Alcohol Abuse and Alcoholism
Curated by ChEMBL
Assay Description
Inverse agonist at mouse brain CB1R expressed in CHOK1 cell membranes assessed as inhibition of CP55940-stimulated [35S]GTP-gammaS binding measured a...
J Med Chem 60: 1126-1141 (2017)
BindingDB Entry DOI: 10.7270/Q2WW7KXF