BDBM50231301 CHEMBL421569
SMILES: CCC(=O)NC1CCc2ccccc2C1
InChI Key: InChIKey=PGUPSDWJGZRTBH-UHFFFAOYSA-N
Data: 1 KI  1 IC50
Activity Spreadsheet -- Enzyme Inhibition Constant Data from BindingDB
Found 2 hits for monomerid = 50231301
Trg + Lig
Ki
nM
ΔG°
kcal/mole
IC50
nM
Kd
nM
EC50/IC50
nM
koff
s-1
kon
M-1s-1
pHTemp
°C
Melatonin receptor
(Gallus gallus-Chick)
BDBM50231301
(CHEMBL421569)
Show SMILES CCC(=O)NC1CCc2ccccc2C1
Show InChI InChI=1S/C13H17NO/c1-2-13(15)14-12-8-7-10-5-3-4-6-11(10)9-12/h3-6,12H,2,7-9H2,1H3,(H,14,15)
145n/an/an/an/an/an/an/an/a
University of Groningen
Curated by ChEMBL
Assay Description
Binding affinity to compete for 2-[125I]iodomelatonin binding to chicken retinal membranes
J Med Chem 36: 2891-8 (1993)
Article DOI: 10.1021/jm00072a008
BindingDB Entry DOI: 10.7270/Q2HT2RJK
Melatonin receptor
(Homo sapiens (Human))
BDBM50231301
(CHEMBL421569)
Show SMILES CCC(=O)NC1CCc2ccccc2C1
Show InChI InChI=1S/C13H17NO/c1-2-13(15)14-12-8-7-10-5-3-4-6-11(10)9-12/h3-6,12H,2,7-9H2,1H3,(H,14,15)
n/an/a 8.10n/an/an/an/an/an/a
University of Groningen
Curated by ChEMBL
Assay Description
Inhibition of 2-[125I]iodomelatonin stimulated calcium dependent dopamine release from the rabbit retina.
J Med Chem 36: 2891-8 (1993)
Article DOI: 10.1021/jm00072a008
BindingDB Entry DOI: 10.7270/Q2HT2RJK