BDBM50231520 (R)-N-[(S)-1-(4-carbamimidoyl-benzylcarbamoyl)-2-hydroxy-ethyl]-3-hydroxy-2-phenylmethanesulfonylamino-propionamide::CHEMBL252937::N-(BENZYLSULFONYL)SERYL-N~1~-{4-[(Z)-AMINO(IMINO)METHYL]BENZYL}SERINAMIDE::US8476306, 6.12
SMILES: NC(=N)c1ccc(CNC(=O)[C@H](CO)NC(=O)[C@@H](CO)NS(=O)(=O)Cc2ccccc2)cc1
InChI Key: InChIKey=ZNOKJHWJKULOGM-ZWKOTPCHSA-N
Data: 6 KI  1 IC50
PDB links: 1 PDB ID matches this monomer.
Activity Spreadsheet -- Enzyme Inhibition Constant Data from BindingDB
Found 7 hits for monomerid = 50231520
Trg + Lig
Ki
nM
ΔG°
kcal/mole
IC50
nM
Kd
nM
EC50/IC50
nM
koff
s-1
kon
M-1s-1
pHTemp
°C
Urokinase-type plasminogen activator/surface receptor
(Homo sapiens (Human))
BDBM50231520
((R)-N-[(S)-1-(4-carbamimidoyl-benzylcarbamoyl)-2-h...)
Show SMILES NC(=N)c1ccc(CNC(=O)[C@H](CO)NC(=O)[C@@H](CO)NS(=O)(=O)Cc2ccccc2)cc1
Show InChI InChI=1S/C21H27N5O6S/c22-19(23)16-8-6-14(7-9-16)10-24-20(29)17(11-27)25-21(30)18(12-28)26-33(31,32)13-15-4-2-1-3-5-15/h1-9,17-18,26-28H,10-13H2,(H3,22,23)(H,24,29)(H,25,30)/t17-,18+/m0/s1
Reactome pathway
20n/an/an/an/an/an/an/an/a
University of Antwerp (UA)
Curated by ChEMBL
Assay Description
Inhibition of human uPA
J Med Chem 58: 9238-57 (2015)
Article DOI: 10.1021/acs.jmedchem.5b01171
BindingDB Entry DOI: 10.7270/Q241713M
3D
3D Structure (crystal)
Trypsin
(Rattus norvegicus)
BDBM50231520
((R)-N-[(S)-1-(4-carbamimidoyl-benzylcarbamoyl)-2-h...)
Show SMILES NC(=N)c1ccc(CNC(=O)[C@H](CO)NC(=O)[C@@H](CO)NS(=O)(=O)Cc2ccccc2)cc1
Show InChI InChI=1S/C21H27N5O6S/c22-19(23)16-8-6-14(7-9-16)10-24-20(29)17(11-27)25-21(30)18(12-28)26-33(31,32)13-15-4-2-1-3-5-15/h1-9,17-18,26-28H,10-13H2,(H3,22,23)(H,24,29)(H,25,30)/t17-,18+/m0/s1
Reactome pathway
US Patent
22 -10.4n/an/an/an/an/an/a24
The Medicines Company
US Patent
Assay Description
Inhibition constant of the compound against Trypsin
US Patent US8476306 (2013)
BindingDB Entry DOI: 10.7270/Q2154FPH
Plasminogen activator urokinase
(Rattus norvegicus)
BDBM50231520
((R)-N-[(S)-1-(4-carbamimidoyl-benzylcarbamoyl)-2-h...)
Show SMILES NC(=N)c1ccc(CNC(=O)[C@H](CO)NC(=O)[C@@H](CO)NS(=O)(=O)Cc2ccccc2)cc1
Show InChI InChI=1S/C21H27N5O6S/c22-19(23)16-8-6-14(7-9-16)10-24-20(29)17(11-27)25-21(30)18(12-28)26-33(31,32)13-15-4-2-1-3-5-15/h1-9,17-18,26-28H,10-13H2,(H3,22,23)(H,24,29)(H,25,30)/t17-,18+/m0/s1
US Patent
25 -10.3n/an/an/an/an/an/a24
The Medicines Company
US Patent
Assay Description
Inhibition constant of the compound against Plasminogen activator urokinase
US Patent US8476306 (2013)
BindingDB Entry DOI: 10.7270/Q2154FPH
Transmembrane protease serine 11D
(Homo sapiens (Human))
BDBM50231520
((R)-N-[(S)-1-(4-carbamimidoyl-benzylcarbamoyl)-2-h...)
Show SMILES NC(=N)c1ccc(CNC(=O)[C@H](CO)NC(=O)[C@@H](CO)NS(=O)(=O)Cc2ccccc2)cc1
Show InChI InChI=1S/C21H27N5O6S/c22-19(23)16-8-6-14(7-9-16)10-24-20(29)17(11-27)25-21(30)18(12-28)26-33(31,32)13-15-4-2-1-3-5-15/h1-9,17-18,26-28H,10-13H2,(H3,22,23)(H,24,29)(H,25,30)/t17-,18+/m0/s1
78n/an/an/an/an/an/an/an/a
Philipps University Marburg
Curated by ChEMBL
Assay Description
Inhibition of human recombinant airway trypsin-like protease HAT using D-cyclohexylalanine-Pro-Arg-AMC as substrate by fluorescence plate reader anal...
Bioorg Med Chem Lett 21: 4860-4 (2011)
Article DOI: 10.1016/j.bmcl.2011.06.033
BindingDB Entry DOI: 10.7270/Q2ST7Q5M
Plasmin
(Rattus norvegicus)
BDBM50231520
((R)-N-[(S)-1-(4-carbamimidoyl-benzylcarbamoyl)-2-h...)
Show SMILES NC(=N)c1ccc(CNC(=O)[C@H](CO)NC(=O)[C@@H](CO)NS(=O)(=O)Cc2ccccc2)cc1
Show InChI InChI=1S/C21H27N5O6S/c22-19(23)16-8-6-14(7-9-16)10-24-20(29)17(11-27)25-21(30)18(12-28)26-33(31,32)13-15-4-2-1-3-5-15/h1-9,17-18,26-28H,10-13H2,(H3,22,23)(H,24,29)(H,25,30)/t17-,18+/m0/s1
Reactome pathway
US Patent
750 -8.32n/an/an/an/an/an/a24
The Medicines Company
US Patent
Assay Description
Inhibition constant of the compound against Plasmin
US Patent US8476306 (2013)
BindingDB Entry DOI: 10.7270/Q2154FPH
Thrombin
(Rattus norvegicus)
BDBM50231520
((R)-N-[(S)-1-(4-carbamimidoyl-benzylcarbamoyl)-2-h...)
Show SMILES NC(=N)c1ccc(CNC(=O)[C@H](CO)NC(=O)[C@@H](CO)NS(=O)(=O)Cc2ccccc2)cc1
Show InChI InChI=1S/C21H27N5O6S/c22-19(23)16-8-6-14(7-9-16)10-24-20(29)17(11-27)25-21(30)18(12-28)26-33(31,32)13-15-4-2-1-3-5-15/h1-9,17-18,26-28H,10-13H2,(H3,22,23)(H,24,29)(H,25,30)/t17-,18+/m0/s1
US Patent
1.40E+4 -6.59n/an/an/an/an/an/a24
The Medicines Company
US Patent
Assay Description
Inhibition constant of the compound against Thrombin
US Patent US8476306 (2013)
BindingDB Entry DOI: 10.7270/Q2154FPH
Urokinase-type plasminogen activator
(Homo sapiens (Human))
BDBM50231520
((R)-N-[(S)-1-(4-carbamimidoyl-benzylcarbamoyl)-2-h...)
Show SMILES NC(=N)c1ccc(CNC(=O)[C@H](CO)NC(=O)[C@@H](CO)NS(=O)(=O)Cc2ccccc2)cc1
Show InChI InChI=1S/C21H27N5O6S/c22-19(23)16-8-6-14(7-9-16)10-24-20(29)17(11-27)25-21(30)18(12-28)26-33(31,32)13-15-4-2-1-3-5-15/h1-9,17-18,26-28H,10-13H2,(H3,22,23)(H,24,29)(H,25,30)/t17-,18+/m0/s1
Reactome pathway
n/an/a 20n/an/an/an/an/an/a
Astex Therapeutics Ltd
Curated by ChEMBL
Assay Description
Inhibition of uPA
J Med Chem 51: 183-6 (2008)
Article DOI: 10.1021/jm701359z
BindingDB Entry DOI: 10.7270/Q2XG9QWK
3D
3D Structure (crystal)