null
SMILES: CCOc1c(Cl)cc(cc1NC(=O)c1cc(C)c(OCCN)c(C)c1)N1CCCCC1
InChI Key: InChIKey=CKBBGCJYKCLKHE-UHFFFAOYSA-N
PDB links: 1 PDB ID matches this monomer.
Activity Spreadsheet -- Enzyme Inhibition Constant Data from BindingDB
Found 2 hits for monomerid = 50231528
Trg + Lig
Ki
nM
ΔG°
kcal/mole
IC50
nM
Kd
nM
EC50/IC50
nM
koff
s-1
kon
M-1s-1
pHTemp
°C
Urokinase-type plasminogen activator
(Homo sapiens (Human))
BDBM50231528
(4-(2-aminoethoxy)-N-(3-chloro-2-ethoxy-5-(piperidi...)
Show SMILES CCOc1c(Cl)cc(cc1NC(=O)c1cc(C)c(OCCN)c(C)c1)N1CCCCC1
Show InChI InChI=1S/C24H32ClN3O3/c1-4-30-23-20(25)14-19(28-9-6-5-7-10-28)15-21(23)27-24(29)18-12-16(2)22(17(3)13-18)31-11-8-26/h12-15H,4-11,26H2,1-3H3,(H,27,29)
Reactome pathway
n/an/a 72n/an/an/an/an/an/a
Astex Therapeutics Ltd.
Curated by ChEMBL
Assay Description
Inhibition of uPA
J Med Chem 51: 3661-80 (2008)
Article DOI: 10.1021/jm8000373
BindingDB Entry DOI: 10.7270/Q2N58M4H
3D
3D Structure (crystal)
Urokinase-type plasminogen activator
(Homo sapiens (Human))
BDBM50231528
(4-(2-aminoethoxy)-N-(3-chloro-2-ethoxy-5-(piperidi...)
Show SMILES CCOc1c(Cl)cc(cc1NC(=O)c1cc(C)c(OCCN)c(C)c1)N1CCCCC1
Show InChI InChI=1S/C24H32ClN3O3/c1-4-30-23-20(25)14-19(28-9-6-5-7-10-28)15-21(23)27-24(29)18-12-16(2)22(17(3)13-18)31-11-8-26/h12-15H,4-11,26H2,1-3H3,(H,27,29)
Reactome pathway
n/an/a 72n/an/an/an/an/an/a
Astex Therapeutics Ltd
Curated by ChEMBL
Assay Description
Inhibition of uPA
J Med Chem 51: 183-6 (2008)
Article DOI: 10.1021/jm701359z
BindingDB Entry DOI: 10.7270/Q2XG9QWK
3D
3D Structure (crystal)