null
SMILES: [Na+].CCc1cc(c(O)cc1OCCCCCC(C)(C)c1nn[n-]n1)-c1ccccc1C
InChI Key: InChIKey=IACAOENIYZIJTE-UHFFFAOYSA-N
Activity Spreadsheet -- Enzyme Inhibition Constant Data from BindingDB
Found 2 hits for monomerid = 50231627
Trg + Lig
Ki
nM
ΔG°
kcal/mole
IC50
nM
Kd
nM
EC50/IC50
nM
koff
s-1
kon
M-1s-1
pHTemp
°C
Leukotriene B4 receptor 1/2
(Homo sapiens (Human))
BDBM50231627
(CHEMBL128888)
Show SMILES [Na+].CCc1cc(c(O)cc1OCCCCCC(C)(C)c1nn[n-]n1)-c1ccccc1C
Show InChI InChI=1S/C24H31N4O2/c1-5-18-15-20(19-12-8-7-11-17(19)2)21(29)16-22(18)30-14-10-6-9-13-24(3,4)23-25-27-28-26-23/h7-8,11-12,15-16H,5-6,9-10,13-14H2,1-4H3,(H-,25,26,27,28,29)/q-1
70n/an/an/an/an/an/an/an/a
Lilly Research Laboratories
Curated by ChEMBL
Assay Description
Inhibition of [3H]LTB4 receptor binding in guinea pig lung membrane
J Med Chem 36: 3978-81 (1993)
Article DOI: 10.1021/jm00076a029
BindingDB Entry DOI: 10.7270/Q20V8G1H
Leukotriene B4 receptor 1/2
(Homo sapiens (Human))
BDBM50231627
(CHEMBL128888)
Show SMILES [Na+].CCc1cc(c(O)cc1OCCCCCC(C)(C)c1nn[n-]n1)-c1ccccc1C
Show InChI InChI=1S/C24H31N4O2/c1-5-18-15-20(19-12-8-7-11-17(19)2)21(29)16-22(18)30-14-10-6-9-13-24(3,4)23-25-27-28-26-23/h7-8,11-12,15-16H,5-6,9-10,13-14H2,1-4H3,(H-,25,26,27,28,29)/q-1
n/an/a 11n/an/an/an/an/an/a
Lilly Research Laboratories
Curated by ChEMBL
Assay Description
Inhibition of [3H]LTB4 receptor binding in human neutrophils
J Med Chem 36: 3978-81 (1993)
Article DOI: 10.1021/jm00076a029
BindingDB Entry DOI: 10.7270/Q20V8G1H