BDBM50231670 (2R,3R,4R,5S)-1-(8-(3-(3H-1,2,3-triazol-4-yl)phenoxy)octyl)-2-(hydroxymethyl)piperidine-3,4,5-triol::CHEMBL254339
SMILES: OC[C@@H]1[C@@H](O)[C@H](O)[C@@H](O)CN1CCCCCCCCOc1cccc(c1)-c1c[nH]nn1
InChI Key: InChIKey=MVQWHGULSMYMBF-CIAFKFPVSA-N
Data: 1 IC50
Activity Spreadsheet -- Enzyme Inhibition Constant Data from BindingDB
Found 1 hit for monomerid = 50231670
Trg + Lig
Ki
nM
ΔG°
kcal/mole
IC50
nM
Kd
nM
EC50/IC50
nM
koff
s-1
kon
M-1s-1
pHTemp
°C
Alpha-glucosidase
(Bacillus stearothermophilus)
BDBM50231670
((2R,3R,4R,5S)-1-(8-(3-(3H-1,2,3-triazol-4-yl)pheno...)
Show SMILES OC[C@@H]1[C@@H](O)[C@H](O)[C@@H](O)CN1CCCCCCCCOc1cccc(c1)-c1c[nH]nn1 |r|
Show InChI InChI=1S/C22H34N4O5/c27-15-19-21(29)22(30)20(28)14-26(19)10-5-3-1-2-4-6-11-31-17-9-7-8-16(12-17)18-13-23-25-24-18/h7-9,12-13,19-22,27-30H,1-6,10-11,14-15H2,(H,23,24,25)/t19-,20+,21-,22-/m1/s1
n/an/a 1.15E+3n/an/an/an/an/an/a
University College Dublin
Curated by ChEMBL
Assay Description
Inhibition of alpha glucosidase from bacillus sterothermophilus
Bioorg Med Chem Lett 18: 954-8 (2008)
Article DOI: 10.1016/j.bmcl.2007.12.034
BindingDB Entry DOI: 10.7270/Q2NZ87C1