BDBM50231894 CHEMBL4100325
SMILES: CC[C@H](C)[C@H](NC(=O)[C@H](Cc1ccccc1)NC(=O)[C@H](CCC(O)=O)NC(=O)[C@H](CCCCN)NC(=O)[C@H](C)NC(=O)[C@H](C)NC(=O)[C@H](CCC(N)=O)NC(=O)[C@@H]1CCCCNC(=O)CC[C@H](NC(=O)[C@H](CO)NC(=O)[C@@H](NC(=O)[C@H](CC(O)=O)NC(=O)[C@H](CO)NC(=O)[C@@H](NC(=O)[C@H](Cc2ccccc2)NC(=O)[C@@H](NC(=O)CNC(=O)[C@H](CCC(O)=O)NC(=O)[C@H](C)NC(=O)[C@@H](N)Cc2cnc[nH]2)[C@@H](C)O)[C@@H](C)O)C(C)C)C(=O)N[C@@H](Cc2ccc(O)cc2)C(=O)N[C@@H](CC(C)C)C(=O)N[C@@H](CCC(O)=O)C(=O)N1)C(=O)N[C@@H](C)C(=O)N[C@@H](Cc1c[nH]c2ccccc12)C(=O)N[C@@H](CC(C)C)C(=O)N[C@@H](C(C)C)C(=O)N[C@@H](CCCCN)C(=O)NCC(=O)N[C@@H](CCCNC(N)=N)C(=O)NCC(N)=O
InChI Key: InChIKey=HSFPZMRAUNIRNW-HBZIHMIASA-N
Data: 1 KI  2 EC50
Activity Spreadsheet -- Enzyme Inhibition Constant Data from BindingDB
Found 3 hits for monomerid = 50231894
Trg + Lig
Ki
nM
ΔG°
kcal/mole
IC50
nM
Kd
nM
EC50/IC50
nM
koff
s-1
kon
M-1s-1
pHTemp
°C
Glucagon-like peptide 1 receptor
(Homo sapiens (Human))
BDBM50231894
(CHEMBL4100325)
Show SMILES CC[C@H](C)[C@H](NC(=O)[C@H](Cc1ccccc1)NC(=O)[C@H](CCC(O)=O)NC(=O)[C@H](CCCCN)NC(=O)[C@H](C)NC(=O)[C@H](C)NC(=O)[C@H](CCC(N)=O)NC(=O)[C@@H]1CCCCNC(=O)CC[C@H](NC(=O)[C@H](CO)NC(=O)[C@@H](NC(=O)[C@H](CC(O)=O)NC(=O)[C@H](CO)NC(=O)[C@@H](NC(=O)[C@H](Cc2ccccc2)NC(=O)[C@@H](NC(=O)CNC(=O)[C@H](CCC(O)=O)NC(=O)[C@H](C)NC(=O)[C@@H](N)Cc2cnc[nH]2)[C@@H](C)O)[C@@H](C)O)C(C)C)C(=O)N[C@@H](Cc2ccc(O)cc2)C(=O)N[C@@H](CC(C)C)C(=O)N[C@@H](CCC(O)=O)C(=O)N1)C(=O)N[C@@H](C)C(=O)N[C@@H](Cc1c[nH]c2ccccc12)C(=O)N[C@@H](CC(C)C)C(=O)N[C@@H](C(C)C)C(=O)N[C@@H](CCCCN)C(=O)NCC(=O)N[C@@H](CCCNC(N)=N)C(=O)NCC(N)=O |r|
Show InChI InChI=1S/C157H238N42O46/c1-17-81(10)126(154(243)176-85(14)132(221)186-111(66-91-69-168-96-38-25-24-37-94(91)96)145(234)188-107(62-78(4)5)146(235)196-124(79(6)7)152(241)185-98(39-26-29-57-158)135(224)170-72-118(208)177-97(42-32-60-167-157(163)164)134(223)169-71-116(162)206)198-147(236)109(63-88-33-20-18-21-34-88)190-142(231)105(51-56-122(214)215)182-138(227)99(40-27-30-58-159)178-130(219)83(12)173-129(218)82(11)175-137(226)102(47-52-115(161)205)181-139(228)100-41-28-31-59-166-117(207)53-48-103(141(230)189-108(65-90-43-45-93(204)46-44-90)144(233)187-106(61-77(2)3)143(232)183-104(140(229)180-100)50-55-121(212)213)184-150(239)113(74-200)193-153(242)125(80(8)9)197-149(238)112(68-123(216)217)191-151(240)114(75-201)194-156(245)128(87(16)203)199-148(237)110(64-89-35-22-19-23-36-89)192-155(244)127(86(15)202)195-119(209)73-171-136(225)101(49-54-120(210)211)179-131(220)84(13)174-133(222)95(160)67-92-70-165-76-172-92/h18-25,33-38,43-46,69-70,76-87,95,97-114,124-128,168,200-204H,17,26-32,39-42,47-68,71-75,158-160H2,1-16H3,(H2,161,205)(H2,162,206)(H,165,172)(H,166,207)(H,169,223)(H,170,224)(H,171,225)(H,173,218)(H,174,222)(H,175,226)(H,176,243)(H,177,208)(H,178,219)(H,179,220)(H,180,229)(H,181,228)(H,182,227)(H,183,232)(H,184,239)(H,185,241)(H,186,221)(H,187,233)(H,188,234)(H,189,230)(H,190,231)(H,191,240)(H,192,244)(H,193,242)(H,194,245)(H,195,209)(H,196,235)(H,197,238)(H,198,236)(H,199,237)(H,210,211)(H,212,213)(H,214,215)(H,216,217)(H4,163,164,167)/t81-,82-,83-,84-,85-,86+,87+,95-,97-,98-,99-,100-,101-,102-,103-,104-,105-,106-,107-,108-,109-,110-,111-,112-,113-,114-,124-,125-,126-,127-,128-/m0/s1
0.800n/an/an/an/an/an/an/an/a
The University of Queensland
Curated by ChEMBL
Assay Description
Displacement of [125I]-GLP (7 to 36 residues) from human GLP1R expressed in CHO cell membranes incubated for 30 mins measured after 10 hrs by scintil...
Eur J Med Chem 127: 703-714 (2017)
BindingDB Entry DOI: 10.7270/Q2T155W1
Glucagon-like peptide 1 receptor
(Homo sapiens (Human))
BDBM50231894
(CHEMBL4100325)
Show SMILES CC[C@H](C)[C@H](NC(=O)[C@H](Cc1ccccc1)NC(=O)[C@H](CCC(O)=O)NC(=O)[C@H](CCCCN)NC(=O)[C@H](C)NC(=O)[C@H](C)NC(=O)[C@H](CCC(N)=O)NC(=O)[C@@H]1CCCCNC(=O)CC[C@H](NC(=O)[C@H](CO)NC(=O)[C@@H](NC(=O)[C@H](CC(O)=O)NC(=O)[C@H](CO)NC(=O)[C@@H](NC(=O)[C@H](Cc2ccccc2)NC(=O)[C@@H](NC(=O)CNC(=O)[C@H](CCC(O)=O)NC(=O)[C@H](C)NC(=O)[C@@H](N)Cc2cnc[nH]2)[C@@H](C)O)[C@@H](C)O)C(C)C)C(=O)N[C@@H](Cc2ccc(O)cc2)C(=O)N[C@@H](CC(C)C)C(=O)N[C@@H](CCC(O)=O)C(=O)N1)C(=O)N[C@@H](C)C(=O)N[C@@H](Cc1c[nH]c2ccccc12)C(=O)N[C@@H](CC(C)C)C(=O)N[C@@H](C(C)C)C(=O)N[C@@H](CCCCN)C(=O)NCC(=O)N[C@@H](CCCNC(N)=N)C(=O)NCC(N)=O |r|
Show InChI InChI=1S/C157H238N42O46/c1-17-81(10)126(154(243)176-85(14)132(221)186-111(66-91-69-168-96-38-25-24-37-94(91)96)145(234)188-107(62-78(4)5)146(235)196-124(79(6)7)152(241)185-98(39-26-29-57-158)135(224)170-72-118(208)177-97(42-32-60-167-157(163)164)134(223)169-71-116(162)206)198-147(236)109(63-88-33-20-18-21-34-88)190-142(231)105(51-56-122(214)215)182-138(227)99(40-27-30-58-159)178-130(219)83(12)173-129(218)82(11)175-137(226)102(47-52-115(161)205)181-139(228)100-41-28-31-59-166-117(207)53-48-103(141(230)189-108(65-90-43-45-93(204)46-44-90)144(233)187-106(61-77(2)3)143(232)183-104(140(229)180-100)50-55-121(212)213)184-150(239)113(74-200)193-153(242)125(80(8)9)197-149(238)112(68-123(216)217)191-151(240)114(75-201)194-156(245)128(87(16)203)199-148(237)110(64-89-35-22-19-23-36-89)192-155(244)127(86(15)202)195-119(209)73-171-136(225)101(49-54-120(210)211)179-131(220)84(13)174-133(222)95(160)67-92-70-165-76-172-92/h18-25,33-38,43-46,69-70,76-87,95,97-114,124-128,168,200-204H,17,26-32,39-42,47-68,71-75,158-160H2,1-16H3,(H2,161,205)(H2,162,206)(H,165,172)(H,166,207)(H,169,223)(H,170,224)(H,171,225)(H,173,218)(H,174,222)(H,175,226)(H,176,243)(H,177,208)(H,178,219)(H,179,220)(H,180,229)(H,181,228)(H,182,227)(H,183,232)(H,184,239)(H,185,241)(H,186,221)(H,187,233)(H,188,234)(H,189,230)(H,190,231)(H,191,240)(H,192,244)(H,193,242)(H,194,245)(H,195,209)(H,196,235)(H,197,238)(H,198,236)(H,199,237)(H,210,211)(H,212,213)(H,214,215)(H,216,217)(H4,163,164,167)/t81-,82-,83-,84-,85-,86+,87+,95-,97-,98-,99-,100-,101-,102-,103-,104-,105-,106-,107-,108-,109-,110-,111-,112-,113-,114-,124-,125-,126-,127-,128-/m0/s1
n/an/an/an/a 0.0410n/an/an/an/a
The University of Queensland
Curated by ChEMBL
Assay Description
Agonist activity at human GLP1R expressed in CHO cells assessed as cAMP accumulation incubated for 30 mins by LANCE assay
Eur J Med Chem 127: 703-714 (2017)
BindingDB Entry DOI: 10.7270/Q2T155W1
Glucagon-like peptide 1 receptor
(Homo sapiens (Human))
BDBM50231894
(CHEMBL4100325)
Show SMILES CC[C@H](C)[C@H](NC(=O)[C@H](Cc1ccccc1)NC(=O)[C@H](CCC(O)=O)NC(=O)[C@H](CCCCN)NC(=O)[C@H](C)NC(=O)[C@H](C)NC(=O)[C@H](CCC(N)=O)NC(=O)[C@@H]1CCCCNC(=O)CC[C@H](NC(=O)[C@H](CO)NC(=O)[C@@H](NC(=O)[C@H](CC(O)=O)NC(=O)[C@H](CO)NC(=O)[C@@H](NC(=O)[C@H](Cc2ccccc2)NC(=O)[C@@H](NC(=O)CNC(=O)[C@H](CCC(O)=O)NC(=O)[C@H](C)NC(=O)[C@@H](N)Cc2cnc[nH]2)[C@@H](C)O)[C@@H](C)O)C(C)C)C(=O)N[C@@H](Cc2ccc(O)cc2)C(=O)N[C@@H](CC(C)C)C(=O)N[C@@H](CCC(O)=O)C(=O)N1)C(=O)N[C@@H](C)C(=O)N[C@@H](Cc1c[nH]c2ccccc12)C(=O)N[C@@H](CC(C)C)C(=O)N[C@@H](C(C)C)C(=O)N[C@@H](CCCCN)C(=O)NCC(=O)N[C@@H](CCCNC(N)=N)C(=O)NCC(N)=O |r|
Show InChI InChI=1S/C157H238N42O46/c1-17-81(10)126(154(243)176-85(14)132(221)186-111(66-91-69-168-96-38-25-24-37-94(91)96)145(234)188-107(62-78(4)5)146(235)196-124(79(6)7)152(241)185-98(39-26-29-57-158)135(224)170-72-118(208)177-97(42-32-60-167-157(163)164)134(223)169-71-116(162)206)198-147(236)109(63-88-33-20-18-21-34-88)190-142(231)105(51-56-122(214)215)182-138(227)99(40-27-30-58-159)178-130(219)83(12)173-129(218)82(11)175-137(226)102(47-52-115(161)205)181-139(228)100-41-28-31-59-166-117(207)53-48-103(141(230)189-108(65-90-43-45-93(204)46-44-90)144(233)187-106(61-77(2)3)143(232)183-104(140(229)180-100)50-55-121(212)213)184-150(239)113(74-200)193-153(242)125(80(8)9)197-149(238)112(68-123(216)217)191-151(240)114(75-201)194-156(245)128(87(16)203)199-148(237)110(64-89-35-22-19-23-36-89)192-155(244)127(86(15)202)195-119(209)73-171-136(225)101(49-54-120(210)211)179-131(220)84(13)174-133(222)95(160)67-92-70-165-76-172-92/h18-25,33-38,43-46,69-70,76-87,95,97-114,124-128,168,200-204H,17,26-32,39-42,47-68,71-75,158-160H2,1-16H3,(H2,161,205)(H2,162,206)(H,165,172)(H,166,207)(H,169,223)(H,170,224)(H,171,225)(H,173,218)(H,174,222)(H,175,226)(H,176,243)(H,177,208)(H,178,219)(H,179,220)(H,180,229)(H,181,228)(H,182,227)(H,183,232)(H,184,239)(H,185,241)(H,186,221)(H,187,233)(H,188,234)(H,189,230)(H,190,231)(H,191,240)(H,192,244)(H,193,242)(H,194,245)(H,195,209)(H,196,235)(H,197,238)(H,198,236)(H,199,237)(H,210,211)(H,212,213)(H,214,215)(H,216,217)(H4,163,164,167)/t81-,82-,83-,84-,85-,86+,87+,95-,97-,98-,99-,100-,101-,102-,103-,104-,105-,106-,107-,108-,109-,110-,111-,112-,113-,114-,124-,125-,126-,127-,128-/m0/s1
n/an/an/an/a 8.60n/an/an/an/a
The University of Queensland
Curated by ChEMBL
Assay Description
Agonist activity at human GLP1R expressed in CHOK1 cells assessed as induction of beta-galactosidase-tagged beta-arrestin2 recruitment incubated for ...
Eur J Med Chem 127: 703-714 (2017)
BindingDB Entry DOI: 10.7270/Q2T155W1