BDBM50232174 CHEMBL4063985
SMILES: Cc1cc(cc(Cl)c1O)-c1ccc(s1)C(=O)c1c(F)ccc(O)c1F
InChI Key: InChIKey=NBPPEXVETXEPTG-UHFFFAOYSA-N
Data: 2 IC50
Activity Spreadsheet -- Enzyme Inhibition Constant Data from BindingDB
Found 2 hits for monomerid = 50232174
Trg + Lig
Ki
nM
ΔG°
kcal/mole
IC50
nM
Kd
nM
EC50/IC50
nM
koff
s-1
kon
M-1s-1
pHTemp
°C
Estradiol 17-beta-dehydrogenase 1
(Homo sapiens (Human))
BDBM50232174
(CHEMBL4063985)
Show SMILES Cc1cc(cc(Cl)c1O)-c1ccc(s1)C(=O)c1c(F)ccc(O)c1F
Show InChI InChI=1S/C18H11ClF2O3S/c1-8-6-9(7-10(19)17(8)23)13-4-5-14(25-13)18(24)15-11(20)2-3-12(22)16(15)21/h2-7,22-23H,1H3
Reactome pathway
n/an/a 0.200n/an/an/an/an/an/a
Saarland University
Curated by ChEMBL
Assay Description
Inhibition of human placental cytosolic 17beta-HSD1 assessed as reduction in activation of [2,4,6,7-3H]-E1 substrate to E2 after 10 mins in presence ...
Eur J Med Chem 127: 944-957 (2017)
BindingDB Entry DOI: 10.7270/Q2WS8WH4
Estradiol 17-beta-dehydrogenase 2
(Homo sapiens (Human))
BDBM50232174
(CHEMBL4063985)
Show SMILES Cc1cc(cc(Cl)c1O)-c1ccc(s1)C(=O)c1c(F)ccc(O)c1F
Show InChI InChI=1S/C18H11ClF2O3S/c1-8-6-9(7-10(19)17(8)23)13-4-5-14(25-13)18(24)15-11(20)2-3-12(22)16(15)21/h2-7,22-23H,1H3
n/an/a 6.5n/an/an/an/an/an/a
Saarland University
Curated by ChEMBL
Assay Description
Inhibition of human placental microsomal 17beta-HSD2 using [2,4,6,7-3H]-E2 as substrate after 20 mins in presence of NAD+ by RP-HPLC method
Eur J Med Chem 127: 944-957 (2017)
BindingDB Entry DOI: 10.7270/Q2WS8WH4