null
SMILES: CN(C)C(=O)c1cn(Cc2ccc(\C=C\C(=O)NO)cc2)c2ccccc12
InChI Key: InChIKey=MVLWIZHSAGUWJK-VAWYXSNFSA-N
Activity Spreadsheet -- Enzyme Inhibition Constant Data from BindingDB
Found 3 hits for monomerid = 50232364
Trg + Lig
Ki
nM
ΔG°
kcal/mole
IC50
nM
Kd
nM
EC50/IC50
nM
koff
s-1
kon
M-1s-1
pHTemp
°C
Histone deacetylase 2
(Homo sapiens (Human))
BDBM50232364
(CHEMBL4086671)
Show SMILES CN(C)C(=O)c1cn(Cc2ccc(\C=C\C(=O)NO)cc2)c2ccccc12
Show InChI InChI=1S/C21H21N3O3/c1-23(2)21(26)18-14-24(19-6-4-3-5-17(18)19)13-16-9-7-15(8-10-16)11-12-20(25)22-27/h3-12,14,27H,13H2,1-2H3,(H,22,25)/b12-11+
NCI pathway
Reactome pathway
n/an/a 1n/an/an/an/an/an/a
Taipei Medical University
Curated by ChEMBL
Assay Description
Inhibition of full length human recombinant C-terminal GST-tagged HDAC2 expressed in insect cells using RHKK(Ac) as substrate after 60 mins by fluori...
Eur J Med Chem 127: 115-127 (2017)
BindingDB Entry DOI: 10.7270/Q20K2BT4
Histone deacetylase 1
(Homo sapiens (Human))
BDBM50232364
(CHEMBL4086671)
Show SMILES CN(C)C(=O)c1cn(Cc2ccc(\C=C\C(=O)NO)cc2)c2ccccc12
Show InChI InChI=1S/C21H21N3O3/c1-23(2)21(26)18-14-24(19-6-4-3-5-17(18)19)13-16-9-7-15(8-10-16)11-12-20(25)22-27/h3-12,14,27H,13H2,1-2H3,(H,22,25)/b12-11+
NCI pathway
Reactome pathway
n/an/a 6.30n/an/an/an/an/an/a
Taipei Medical University
Curated by ChEMBL
Assay Description
Inhibition of full length human recombinant C-terminal FLAG-His-tagged HDAC1 expressed in Sf21 cells using RHKK(Ac) as substrate after 60 mins by flu...
Eur J Med Chem 127: 115-127 (2017)
BindingDB Entry DOI: 10.7270/Q20K2BT4
Histone deacetylase 6
(Homo sapiens (Human))
BDBM50232364
(CHEMBL4086671)
Show SMILES CN(C)C(=O)c1cn(Cc2ccc(\C=C\C(=O)NO)cc2)c2ccccc12
Show InChI InChI=1S/C21H21N3O3/c1-23(2)21(26)18-14-24(19-6-4-3-5-17(18)19)13-16-9-7-15(8-10-16)11-12-20(25)22-27/h3-12,14,27H,13H2,1-2H3,(H,22,25)/b12-11+
NCI pathway
Reactome pathway
n/an/a 8.5n/an/an/an/an/an/a
Taipei Medical University
Curated by ChEMBL
Assay Description
Inhibition of full length human recombinant N-terminal GST-tagged HDAC6 expressed in Sf9 cells using RHKK(Ac) as substrate after 90 mins by fluorimet...
Eur J Med Chem 127: 115-127 (2017)
BindingDB Entry DOI: 10.7270/Q20K2BT4